{"text_format":"3","workbook":"xlsx","n_sheets":2,"sheets":["C05 影像科影像技术技师","C06影像科信息网络工程师"],"not_rendered":{"external_links":6,"defined_names":1},"read":"whole","date_system":"1900"}

{"sheet":"C05 影像科影像技术技师","index":0,"n_rows":290,"n_cols":12,"rows_kept":290}
["序号","报名序号","姓名","身份证号","岗位名称","岗位代码","考考场号","抽签号","原始面试成绩","修正系数","最终面试成绩","是否进入资格复审"]
[277,"52003050006","赵雪","5224241******14641","影像科影像技术技师","C05","第二考场",{"$f":"VLOOKUP(C:C,[2]sheet1!$E$1:$F$65536,2,FALSE)","v":17},{"$f":"VLOOKUP(H:H,[4]Sheet1!$A$5:$I$76,9,FALSE)","v":{"v":88.3333333333333,"d":"88.33"}},{"v":1.04253796519585,"d":"1.04"},{"$f":"J2*I2","v":{"v":92.0908535923,"d":"92.09"}},"是"]
[64,"52003050023","周懿杨","5002261******21210","影像科影像技术技师","C05","第一考场",{"$f":"VLOOKUP(C:C,[1]sheet1!$E$1:$F$65536,2,FALSE)","v":59},{"$f":"VLOOKUP(H:H,[3]Sheet1!$A$5:$K$79,11,FALSE)","v":{"v":95,"d":"95.00"}},{"v":0.960797245607965,"d":"0.96"},{"v":91.2757383327567,"d":"91.28"},"是"]
[149,"52003050021","何虹燕","5201231******81226","影像科影像技术技师","C05","第一考场",{"$f":"VLOOKUP(C:C,[1]sheet1!$E$1:$F$65536,2,FALSE)","v":150},{"$f":"VLOOKUP(H:H,[3]Sheet1!$A$5:$K$79,11,FALSE)","v":{"v":94,"d":"94.00"}},{"v":0.960797245607965,"d":"0.96"},{"v":90.3149410871487,"d":"90.31"},"是"]
[37,"52003050009","彭超","5224251******11555","影像科影像技术技师","C05","第一考场",{"$f":"VLOOKUP(C:C,[1]sheet1!$E$1:$F$65536,2,FALSE)","v":146},{"$f":"VLOOKUP(H:H,[3]Sheet1!$A$5:$K$79,11,FALSE)","v":{"v":91.6666666666667,"d":"91.67"}},{"v":0.960797245607965,"d":"0.96"},{"v":88.0730808473968,"d":"88.07"},"是"]
[18,"52003050019","熊禧宏","5201032******86716","影像科影像技术技师","C05","第一考场",{"$f":"VLOOKUP(C:C,[1]sheet1!$E$1:$F$65536,2,FALSE)","v":7},{"$f":"VLOOKUP(H:H,[3]Sheet1!$A$5:$K$79,11,FALSE)","v":{"v":91.6666666666667,"d":"91.67"}},{"v":0.960797245607965,"d":"0.96"},{"v":88.0730808473968,"d":"88.07"},"是"]
[261,"52003050088","周涛","5224281******5124X","影像科影像技术技师","C05","第二考场",{"$f":"VLOOKUP(C:C,[2]sheet1!$E$1:$F$65536,2,FALSE)","v":116},{"$f":"VLOOKUP(H:H,[4]Sheet1!$A$5:$I$76,9,FALSE)","v":{"v":84,"d":"84.00"}},{"v":1.04253796519585,"d":"1.04"},{"v":87.5731890764514,"d":"87.57"}]
[201,"52003050244","袁小点","5225011******67347","影像科影像技术技师","C05","第二考场",{"$f":"VLOOKUP(C:C,[2]sheet1!$E$1:$F$65536,2,FALSE)","v":85},{"$f":"VLOOKUP(H:H,[4]Sheet1!$A$5:$I$76,9,FALSE)","v":{"v":83.3333333333333,"d":"83.33"}},{"v":1.04253796519585,"d":"1.04"},{"v":86.8781637663208,"d":"86.88"}]
[179,"52003050131","谢沁玲","5221212******91424","影像科影像技术技师","C05","第二考场",{"$f":"VLOOKUP(C:C,[2]sheet1!$E$1:$F$65536,2,FALSE)","v":79},{"$f":"VLOOKUP(H:H,[4]Sheet1!$A$5:$I$76,9,FALSE)","v":{"v":82.3333333333333,"d":"82.33"}},{"v":1.04253796519585,"d":"1.04"},{"v":85.8356258011249,"d":"85.84"}]
[240,"52003050043","赵婷婷","5221221******77445","影像科影像技术技师","C05","第二考场",{"$f":"VLOOKUP(C:C,[2]sheet1!$E$1:$F$65536,2,FALSE)","v":86},{"$f":"VLOOKUP(H:H,[4]Sheet1!$A$5:$I$76,9,FALSE)","v":{"v":81.6666666666667,"d":"81.67"}},{"v":1.04253796519585,"d":"1.04"},{"v":85.1406004909944,"d":"85.14"}]
[206,"52003050223","胡雪","5224261******07147","影像科影像技术技师","C05","第二考场",{"$f":"VLOOKUP(C:C,[2]sheet1!$E$1:$F$65536,2,FALSE)","v":28},{"$f":"VLOOKUP(H:H,[4]Sheet1!$A$5:$I$76,9,FALSE)","v":{"v":81.3333333333333,"d":"81.33"}},{"v":1.04253796519585,"d":"1.04"},{"v":84.7930878359291,"d":"84.79"}]
[273,"52003050145","刘芳","5224251******66920","影像科影像技术技师","C05","第二考场",{"$f":"VLOOKUP(C:C,[2]sheet1!$E$1:$F$65536,2,FALSE)","v":126},{"$f":"VLOOKUP(H:H,[4]Sheet1!$A$5:$I$76,9,FALSE)","v":{"v":80.6666666666667,"d":"80.67"}},{"v":1.04253796519585,"d":"1.04"},{"v":84.0980625257986,"d":"84.10"}]
[205,"52003050158","郭涛涛","5204242******80089","影像科影像技术技师","C05","第二考场",{"$f":"VLOOKUP(C:C,[2]sheet1!$E$1:$F$65536,2,FALSE)","v":127},{"$f":"VLOOKUP(H:H,[4]Sheet1!$A$5:$I$76,9,FALSE)","v":{"v":80,"d":"80.00"}},{"v":1.04253796519585,"d":"1.04"},{"v":83.403037215668,"d":"83.40"}]
[197,"52003050097","骆林","5221281******86515","影像科影像技术技师","C05","第二考场",{"$f":"VLOOKUP(C:C,[2]sheet1!$E$1:$F$65536,2,FALSE)","v":106},{"$f":"VLOOKUP(H:H,[4]Sheet1!$A$5:$I$76,9,FALSE)","v":{"v":79.3333333333333,"d":"79.33"}},{"v":1.04253796519585,"d":"1.04"},{"v":82.7080119055374,"d":"82.71"}]
[223,"52003050062","谢红","5224221******50838","影像科影像技术技师","C05","第二考场",{"$f":"VLOOKUP(C:C,[2]sheet1!$E$1:$F$65536,2,FALSE)","v":71},{"$f":"VLOOKUP(H:H,[4]Sheet1!$A$5:$I$76,9,FALSE)","v":{"v":79.3333333333333,"d":"79.33"}},{"v":1.04253796519585,"d":"1.04"},{"v":82.7080119055374,"d":"82.71"}]
[159,"52003050111","李小明","5224261******62057","影像科影像技术技师","C05","第二考场",{"$f":"VLOOKUP(C:C,[2]sheet1!$E$1:$F$65536,2,FALSE)","v":18},{"$f":"VLOOKUP(H:H,[4]Sheet1!$A$5:$I$76,9,FALSE)","v":{"v":79,"d":"79.00"}},{"v":1.04253796519585,"d":"1.04"},{"v":82.3604992504721,"d":"82.36"}]
[160,"52003050176","马小妮","5221281******34024","影像科影像技术技师","C05","第二考场",{"$f":"VLOOKUP(C:C,[2]sheet1!$E$1:$F$65536,2,FALSE)","v":125},{"$f":"VLOOKUP(H:H,[4]Sheet1!$A$5:$I$76,9,FALSE)","v":{"v":79,"d":"79.00"}},{"v":1.04253796519585,"d":"1.04"},{"v":82.3604992504721,"d":"82.36"}]
[233,"52003050102","李国富","5221311******3481X","影像科影像技术技师","C05","第二考场",{"$f":"VLOOKUP(C:C,[2]sheet1!$E$1:$F$65536,2,FALSE)","v":136},{"$f":"VLOOKUP(H:H,[4]Sheet1!$A$5:$I$76,9,FALSE)","v":{"v":79,"d":"79.00"}},{"v":1.04253796519585,"d":"1.04"},{"v":82.3604992504721,"d":"82.36"}]
[266,"52003050197","吉祥","5224012******1381X","影像科影像技术技师","C05","第二考场",{"$f":"VLOOKUP(C:C,[2]sheet1!$E$1:$F$65536,2,FALSE)","v":96},{"$f":"VLOOKUP(H:H,[4]Sheet1!$A$5:$I$76,9,FALSE)","v":{"v":79,"d":"79.00"}},{"v":1.04253796519585,"d":"1.04"},{"v":82.3604992504721,"d":"82.36"}]
[13,"52003050068","朱琳","4307031******91664","影像科影像技术技师","C05","第一考场",{"$f":"VLOOKUP(C:C,[1]sheet1!$E$1:$F$65536,2,FALSE)","v":37},{"$f":"VLOOKUP(H:H,[3]Sheet1!$A$5:$K$79,11,FALSE)","v":{"v":85.6666666666667,"d":"85.67"}},{"v":0.960797245607965,"d":"0.96"},{"v":82.308297373749,"d":"82.31"}]
[88,"52003050165","田霞","5221271******22060","影像科影像技术技师","C05","第一考场",{"$f":"VLOOKUP(C:C,[1]sheet1!$E$1:$F$65536,2,FALSE)","v":68},{"$f":"VLOOKUP(H:H,[3]Sheet1!$A$5:$K$79,11,FALSE)","v":{"v":85.6666666666667,"d":"85.67"}},{"v":0.960797245607965,"d":"0.96"},{"v":82.308297373749,"d":"82.31"}]
[38,"52003050050","唐安凤","5222271******07228","影像科影像技术技师","C05","第一考场",{"$f":"VLOOKUP(C:C,[1]sheet1!$E$1:$F$65536,2,FALSE)","v":50},{"$f":"VLOOKUP(H:H,[3]Sheet1!$A$5:$K$79,11,FALSE)","v":{"v":85.6666666666667,"d":"85.67"}},{"v":0.960797245607965,"d":"0.96"},{"v":82.308297373749,"d":"82.31"}]
[74,"52003050061","彭军景","5221211******87451","影像科影像技术技师","C05","第一考场",{"$f":"VLOOKUP(C:C,[1]sheet1!$E$1:$F$65536,2,FALSE)","v":55},{"$f":"VLOOKUP(H:H,[3]Sheet1!$A$5:$K$79,11,FALSE)","v":{"v":84.6666666666667,"d":"84.67"}},{"v":0.960797245607965,"d":"0.96"},{"v":81.3475001281411,"d":"81.35"}]
[282,"52003050228","林丽华","5221221******01841","影像科影像技术技师","C05","第二考场",{"$f":"VLOOKUP(C:C,[2]sheet1!$E$1:$F$65536,2,FALSE)","v":52},{"$f":"VLOOKUP(H:H,[4]Sheet1!$A$5:$I$76,9,FALSE)","v":{"v":78,"d":"78.00"}},{"v":1.04253796519585,"d":"1.04"},{"v":81.3179612852763,"d":"81.32"}]
[67,"52003050080","陈青娜","5221221******20866","影像科影像技术技师","C05","第一考场",{"$f":"VLOOKUP(C:C,[1]sheet1!$E$1:$F$65536,2,FALSE)","v":82},{"$f":"VLOOKUP(H:H,[3]Sheet1!$A$5:$K$79,11,FALSE)","v":{"v":84.3333333333333,"d":"84.33"}},{"v":0.960797245607965,"d":"0.96"},{"v":81.027234379605,"d":"81.03"}]
[72,"52003050058","杨薇","5002231******5666X","影像科影像技术技师","C05","第一考场",{"$f":"VLOOKUP(C:C,[1]sheet1!$E$1:$F$65536,2,FALSE)","v":140},{"$f":"VLOOKUP(H:H,[3]Sheet1!$A$5:$K$79,11,FALSE)","v":{"v":84.3333333333333,"d":"84.33"}},{"v":0.960797245607965,"d":"0.96"},{"v":81.027234379605,"d":"81.03"}]
[209,"52003050037","宋优","5221252******81916","影像科影像技术技师","C05","第二考场",{"$f":"VLOOKUP(C:C,[2]sheet1!$E$1:$F$65536,2,FALSE)","v":139},{"$f":"VLOOKUP(H:H,[4]Sheet1!$A$5:$I$76,9,FALSE)","v":{"v":77.6666666666667,"d":"77.67"}},{"v":1.04253796519585,"d":"1.04"},{"v":80.9704486302111,"d":"80.97"}]
[31,"52003050166","范清颜","5221221******06040","影像科影像技术技师","C05","第一考场",{"$f":"VLOOKUP(C:C,[1]sheet1!$E$1:$F$65536,2,FALSE)","v":122},{"$f":"VLOOKUP(H:H,[3]Sheet1!$A$5:$K$79,11,FALSE)","v":{"v":84,"d":"84.00"}},{"v":0.960797245607965,"d":"0.96"},{"v":80.7069686310691,"d":"80.71"}]
[70,"52003050210","刘伟伟","5225291******62630","影像科影像技术技师","C05","第一考场",{"$f":"VLOOKUP(C:C,[1]sheet1!$E$1:$F$65536,2,FALSE)","v":117},{"$f":"VLOOKUP(H:H,[3]Sheet1!$A$5:$K$79,11,FALSE)","v":{"v":84,"d":"84.00"}},{"v":0.960797245607965,"d":"0.96"},{"v":80.7069686310691,"d":"80.71"}]
[271,"52003050017","王娜","5222241******85026","影像科影像技术技师","C05","第二考场",{"$f":"VLOOKUP(C:C,[2]sheet1!$E$1:$F$65536,2,FALSE)","v":120},{"$f":"VLOOKUP(H:H,[4]Sheet1!$A$5:$I$76,9,FALSE)","v":{"v":77.3333333333333,"d":"77.33"}},{"v":1.04253796519585,"d":"1.04"},{"v":80.6229359751457,"d":"80.62"}]
[75,"52003050109","胡舟鹏","5223281******60213","影像科影像技术技师","C05","第一考场",{"$f":"VLOOKUP(C:C,[1]sheet1!$E$1:$F$65536,2,FALSE)","v":25},{"$f":"VLOOKUP(H:H,[3]Sheet1!$A$5:$K$79,11,FALSE)","v":{"v":83.6666666666667,"d":"83.67"}},{"v":0.960797245607965,"d":"0.96"},{"v":80.3867028825331,"d":"80.39"}]
[103,"52003050100","徐瑞瑞","5221231******42518","影像科影像技术技师","C05","第一考场",{"$f":"VLOOKUP(C:C,[1]sheet1!$E$1:$F$65536,2,FALSE)","v":100},{"$f":"VLOOKUP(H:H,[3]Sheet1!$A$5:$K$79,11,FALSE)","v":{"v":83.3333333333333,"d":"83.33"}},{"v":0.960797245607965,"d":"0.96"},{"v":80.0664371339971,"d":"80.07"}]
[267,"52003050056","何小凤","5221211******87245","影像科影像技术技师","C05","第二考场",{"$f":"VLOOKUP(C:C,[2]sheet1!$E$1:$F$65536,2,FALSE)","v":100},{"$f":"VLOOKUP(H:H,[4]Sheet1!$A$5:$I$76,9,FALSE)","v":{"v":76.6666666666667,"d":"76.67"}},{"v":1.04253796519585,"d":"1.04"},{"v":79.9279106650152,"d":"79.93"}]
[272,"52003050142","冉飞艳","5221261******76527","影像科影像技术技师","C05","第二考场",{"$f":"VLOOKUP(C:C,[2]sheet1!$E$1:$F$65536,2,FALSE)","v":103},{"$f":"VLOOKUP(H:H,[4]Sheet1!$A$5:$I$76,9,FALSE)","v":{"v":76.6666666666667,"d":"76.67"}},{"v":1.04253796519585,"d":"1.04"},{"v":79.9279106650152,"d":"79.93"}]
[53,"52003050248","罗倩","5202211******81147","影像科影像技术技师","C05","第一考场",{"$f":"VLOOKUP(C:C,[1]sheet1!$E$1:$F$65536,2,FALSE)","v":144},{"$f":"VLOOKUP(H:H,[3]Sheet1!$A$5:$K$79,11,FALSE)","v":{"v":83,"d":"83.00"}},{"v":0.960797245607965,"d":"0.96"},{"v":79.7461713854611,"d":"79.75"}]
[61,"52003050295","王文芳","5224241******01823","影像科影像技术技师","C05","第一考场",{"$f":"VLOOKUP(C:C,[1]sheet1!$E$1:$F$65536,2,FALSE)","v":93},{"$f":"VLOOKUP(H:H,[3]Sheet1!$A$5:$K$79,11,FALSE)","v":{"v":82.6666666666667,"d":"82.67"}},{"v":0.960797245607965,"d":"0.96"},{"v":79.4259056369251,"d":"79.43"}]
[139,"52003050183","侯嫚","5224281******71444","影像科影像技术技师","C05","第一考场",{"$f":"VLOOKUP(C:C,[1]sheet1!$E$1:$F$65536,2,FALSE)","v":107},{"$f":"VLOOKUP(H:H,[3]Sheet1!$A$5:$K$79,11,FALSE)","v":{"v":82.6666666666667,"d":"82.67"}},{"v":0.960797245607965,"d":"0.96"},{"v":79.4259056369251,"d":"79.43"}]
[129,"52003050090","高宇航","5224251******58171","影像科影像技术技师","C05","第一考场",{"$f":"VLOOKUP(C:C,[1]sheet1!$E$1:$F$65536,2,FALSE)","v":11},{"$f":"VLOOKUP(H:H,[3]Sheet1!$A$5:$K$79,11,FALSE)","v":{"v":82,"d":"82.00"}},{"v":0.960797245607965,"d":"0.96"},{"v":78.7853741398531,"d":"78.79"}]
[7,"52003050038","周子栋","5221011******32018","影像科影像技术技师","C05","第一考场",{"$f":"VLOOKUP(C:C,[1]sheet1!$E$1:$F$65536,2,FALSE)","v":52},{"$f":"VLOOKUP(H:H,[3]Sheet1!$A$5:$K$79,11,FALSE)","v":{"v":82,"d":"82.00"}},{"v":0.960797245607965,"d":"0.96"},{"v":78.7853741398531,"d":"78.79"}]
[188,"52003050039","徐晓鹏","5201231******10051","影像科影像技术技师","C05","第二考场",{"$f":"VLOOKUP(C:C,[2]sheet1!$E$1:$F$65536,2,FALSE)","v":113},{"$f":"VLOOKUP(H:H,[4]Sheet1!$A$5:$I$76,9,FALSE)","v":{"v":74.6666666666667,"d":"74.67"}},{"v":1.04253796519585,"d":"1.04"},{"v":77.8428347346235,"d":"77.84"}]
[73,"52003050138","刘泽君","5201221******42211","影像科影像技术技师","C05","第一考场",{"$f":"VLOOKUP(C:C,[1]sheet1!$E$1:$F$65536,2,FALSE)","v":15},{"$f":"VLOOKUP(H:H,[3]Sheet1!$A$5:$K$79,11,FALSE)","v":{"v":80.3333333333333,"d":"80.33"}},{"v":0.960797245607965,"d":"0.96"},{"v":77.1840453971732,"d":"77.18"}]
[264,"52003050167","陈金刚","5227311******51293","影像科影像技术技师","C05","第二考场",{"$f":"VLOOKUP(C:C,[2]sheet1!$E$1:$F$65536,2,FALSE)","v":124},{"$f":"VLOOKUP(H:H,[4]Sheet1!$A$5:$I$76,9,FALSE)","v":{"v":74,"d":"74.00"}},{"v":1.04253796519585,"d":"1.04"},{"v":77.1478094244929,"d":"77.15"}]
[287,"52003050202","张树","5224222******2702X","影像科影像技术技师","C05","第二考场",{"$f":"VLOOKUP(C:C,[2]sheet1!$E$1:$F$65536,2,FALSE)","v":121},{"$f":"VLOOKUP(H:H,[4]Sheet1!$A$5:$I$76,9,FALSE)","v":{"v":74,"d":"74.00"}},{"v":1.04253796519585,"d":"1.04"},{"v":77.1478094244929,"d":"77.15"}]
[238,"52003050098","杨正霞","5227271******74523","影像科影像技术技师","C05","第二考场",{"$f":"VLOOKUP(C:C,[2]sheet1!$E$1:$F$65536,2,FALSE)","v":133},{"$f":"VLOOKUP(H:H,[4]Sheet1!$A$5:$I$76,9,FALSE)","v":{"v":73.6666666666667,"d":"73.67"}},{"v":1.04253796519585,"d":"1.04"},{"v":76.8002967694276,"d":"76.80"}]
[162,"52003050010","吴双林","5222272******24813","影像科影像技术技师","C05","第二考场",{"$f":"VLOOKUP(C:C,[2]sheet1!$E$1:$F$65536,2,FALSE)","v":129},{"$f":"VLOOKUP(H:H,[4]Sheet1!$A$5:$I$76,9,FALSE)","v":{"v":73.3333333333333,"d":"73.33"}},{"v":1.04253796519585,"d":"1.04"},{"v":76.4527841143623,"d":"76.45"}]
[173,"52003050024","安晓芳","5222281******52843","影像科影像技术技师","C05","第二考场",{"$f":"VLOOKUP(C:C,[2]sheet1!$E$1:$F$65536,2,FALSE)","v":55},{"$f":"VLOOKUP(H:H,[4]Sheet1!$A$5:$I$76,9,FALSE)","v":{"v":73.3333333333333,"d":"73.33"}},{"v":1.04253796519585,"d":"1.04"},{"v":76.4527841143623,"d":"76.45"}]
[182,"52003050169","邓方微","5224231******37328","影像科影像技术技师","C05","第二考场",{"$f":"VLOOKUP(C:C,[2]sheet1!$E$1:$F$65536,2,FALSE)","v":43},{"$f":"VLOOKUP(H:H,[4]Sheet1!$A$5:$I$76,9,FALSE)","v":{"v":73.3333333333333,"d":"73.33"}},{"v":1.04253796519585,"d":"1.04"},{"v":76.4527841143623,"d":"76.45"}]
[184,"52003050067","安启运","5224231******03625","影像科影像技术技师","C05","第二考场",{"$f":"VLOOKUP(C:C,[2]sheet1!$E$1:$F$65536,2,FALSE)","v":9},{"$f":"VLOOKUP(H:H,[4]Sheet1!$A$5:$I$76,9,FALSE)","v":{"v":73.3333333333333,"d":"73.33"}},{"v":1.04253796519585,"d":"1.04"},{"v":76.4527841143623,"d":"76.45"}]
[3,"52003050178","谢伟","5222251******60413","影像科影像技术技师","C05","第一考场",{"$f":"VLOOKUP(C:C,[1]sheet1!$E$1:$F$65536,2,FALSE)","v":123},{"$f":"VLOOKUP(H:H,[3]Sheet1!$A$5:$K$79,11,FALSE)","v":{"v":78.6666666666667,"d":"78.67"}},{"v":0.960797245607965,"d":"0.96"},{"v":75.5827166544933,"d":"75.58"}]
[69,"52003050189","张杰","5224011******47413","影像科影像技术技师","C05","第一考场",{"$f":"VLOOKUP(C:C,[1]sheet1!$E$1:$F$65536,2,FALSE)","v":125},{"$f":"VLOOKUP(H:H,[3]Sheet1!$A$5:$K$79,11,FALSE)","v":{"v":78.6666666666667,"d":"78.67"}},{"v":0.960797245607965,"d":"0.96"},{"v":75.5827166544933,"d":"75.58"}]
[99,"52003050084","王徐钊","5221262******11510","影像科影像技术技师","C05","第一考场",{"$f":"VLOOKUP(C:C,[1]sheet1!$E$1:$F$65536,2,FALSE)","v":128},{"$f":"VLOOKUP(H:H,[3]Sheet1!$A$5:$K$79,11,FALSE)","v":{"v":78.6666666666667,"d":"78.67"}},{"v":0.960797245607965,"d":"0.96"},{"v":75.5827166544933,"d":"75.58"}]
[144,"52003050188","李登剑","5221281******85032","影像科影像技术技师","C05","第一考场",{"$f":"VLOOKUP(C:C,[1]sheet1!$E$1:$F$65536,2,FALSE)","v":126},{"$f":"VLOOKUP(H:H,[3]Sheet1!$A$5:$K$79,11,FALSE)","v":{"v":78.3333333333333,"d":"78.33"}},{"v":0.960797245607965,"d":"0.96"},{"v":75.2624509059572,"d":"75.26"}]
[94,"52003050289","朱娴","5201812******40822","影像科影像技术技师","C05","第一考场",{"$f":"VLOOKUP(C:C,[1]sheet1!$E$1:$F$65536,2,FALSE)","v":112},{"$f":"VLOOKUP(H:H,[3]Sheet1!$A$5:$K$79,11,FALSE)","v":{"v":78.3333333333333,"d":"78.33"}},{"v":0.960797245607965,"d":"0.96"},{"v":75.2624509059572,"d":"75.26"}]
[171,"52003050211","王鹏杰","5222241******14810","影像科影像技术技师","C05","第二考场",{"$f":"VLOOKUP(C:C,[2]sheet1!$E$1:$F$65536,2,FALSE)","v":132},{"$f":"VLOOKUP(H:H,[4]Sheet1!$A$5:$I$76,9,FALSE)","v":{"v":72,"d":"72.00"}},{"v":1.04253796519585,"d":"1.04"},{"v":75.0627334941012,"d":"75.06"}]
[226,"52003050149","李婷婷","5221241******43626","影像科影像技术技师","C05","第二考场",{"$f":"VLOOKUP(C:C,[2]sheet1!$E$1:$F$65536,2,FALSE)","v":83},{"$f":"VLOOKUP(H:H,[4]Sheet1!$A$5:$I$76,9,FALSE)","v":{"v":72,"d":"72.00"}},{"v":1.04253796519585,"d":"1.04"},{"v":75.0627334941012,"d":"75.06"}]
[245,"52003050243","何梅梅","5222251******44844","影像科影像技术技师","C05","第二考场",{"$f":"VLOOKUP(C:C,[2]sheet1!$E$1:$F$65536,2,FALSE)","v":47},{"$f":"VLOOKUP(H:H,[4]Sheet1!$A$5:$I$76,9,FALSE)","v":{"v":72,"d":"72.00"}},{"v":1.04253796519585,"d":"1.04"},{"v":75.0627334941012,"d":"75.06"}]
[100,"52003050106","杨超","5221211******94214","影像科影像技术技师","C05","第一考场",{"$f":"VLOOKUP(C:C,[1]sheet1!$E$1:$F$65536,2,FALSE)","v":74},{"$f":"VLOOKUP(H:H,[3]Sheet1!$A$5:$K$79,11,FALSE)","v":{"v":78,"d":"78.00"}},{"v":0.960797245607965,"d":"0.96"},{"v":74.9421851574213,"d":"74.94"}]
[87,"52003050119","李碧","5221301******47245","影像科影像技术技师","C05","第一考场",{"$f":"VLOOKUP(C:C,[1]sheet1!$E$1:$F$65536,2,FALSE)","v":79},{"$f":"VLOOKUP(H:H,[3]Sheet1!$A$5:$K$79,11,FALSE)","v":{"v":78,"d":"78.00"}},{"v":0.960797245607965,"d":"0.96"},{"v":74.9421851574213,"d":"74.94"}]
[58,"52003050002","李敏","5221301******73244","影像科影像技术技师","C05","第一考场",{"$f":"VLOOKUP(C:C,[1]sheet1!$E$1:$F$65536,2,FALSE)","v":5},{"$f":"VLOOKUP(H:H,[3]Sheet1!$A$5:$K$79,11,FALSE)","v":{"v":78,"d":"78.00"}},{"v":0.960797245607965,"d":"0.96"},{"v":74.9421851574213,"d":"74.94"}]
[231,"52003050171","唐若男","5227222******22121","影像科影像技术技师","C05","第二考场",{"$f":"VLOOKUP(C:C,[2]sheet1!$E$1:$F$65536,2,FALSE)","v":130},{"$f":"VLOOKUP(H:H,[4]Sheet1!$A$5:$I$76,9,FALSE)","v":{"v":71.6666666666667,"d":"71.67"}},{"v":1.04253796519585,"d":"1.04"},{"v":74.715220839036,"d":"74.72"}]
[242,"52003050055","赵发辉","5201222******53819","影像科影像技术技师","C05","第二考场",{"$f":"VLOOKUP(C:C,[2]sheet1!$E$1:$F$65536,2,FALSE)","v":117},{"$f":"VLOOKUP(H:H,[4]Sheet1!$A$5:$I$76,9,FALSE)","v":{"v":71.6666666666667,"d":"71.67"}},{"v":1.04253796519585,"d":"1.04"},{"v":74.715220839036,"d":"74.72"}]
[256,"52003050033","谢坤","5223232******91319","影像科影像技术技师","C05","第二考场",{"$f":"VLOOKUP(C:C,[2]sheet1!$E$1:$F$65536,2,FALSE)","v":72},{"$f":"VLOOKUP(H:H,[4]Sheet1!$A$5:$I$76,9,FALSE)","v":{"v":71.6666666666667,"d":"71.67"}},{"v":1.04253796519585,"d":"1.04"},{"v":74.715220839036,"d":"74.72"}]
[23,"52003050263","刘星","5224262******85310","影像科影像技术技师","C05","第一考场",{"$f":"VLOOKUP(C:C,[1]sheet1!$E$1:$F$65536,2,FALSE)","v":91},{"$f":"VLOOKUP(H:H,[3]Sheet1!$A$5:$K$79,11,FALSE)","v":{"v":77.6666666666667,"d":"77.67"}},{"v":0.960797245607965,"d":"0.96"},{"v":74.6219194088853,"d":"74.62"}]
[109,"52003050110","杨锐","5221301******2001X","影像科影像技术技师","C05","第一考场",{"$f":"VLOOKUP(C:C,[1]sheet1!$E$1:$F$65536,2,FALSE)","v":35},{"$f":"VLOOKUP(H:H,[3]Sheet1!$A$5:$K$79,11,FALSE)","v":{"v":77.3333333333333,"d":"77.33"}},{"v":0.960797245607965,"d":"0.96"},{"v":74.3016536603493,"d":"74.30"}]
[164,"52003050207","龙艳","5225291******14448","影像科影像技术技师","C05","第二考场",{"$f":"VLOOKUP(C:C,[2]sheet1!$E$1:$F$65536,2,FALSE)","v":29},{"$f":"VLOOKUP(H:H,[4]Sheet1!$A$5:$I$76,9,FALSE)","v":{"v":71,"d":"71.00"}},{"v":1.04253796519585,"d":"1.04"},{"v":74.0201955289053,"d":"74.02"}]
[51,"52003050052","王松善","5303241******02359","影像科影像技术技师","C05","第一考场",{"$f":"VLOOKUP(C:C,[1]sheet1!$E$1:$F$65536,2,FALSE)","v":97},{"$f":"VLOOKUP(H:H,[3]Sheet1!$A$5:$K$79,11,FALSE)","v":{"v":77,"d":"77.00"}},{"v":0.960797245607965,"d":"0.96"},{"$f":"J66*I66","v":{"v":73.9813879118133,"d":"73.98"}}]
[98,"52003050092","程浩楠","5221301******47231","影像科影像技术技师","C05","第一考场",{"$f":"VLOOKUP(C:C,[1]sheet1!$E$1:$F$65536,2,FALSE)","v":115},{"$f":"VLOOKUP(H:H,[3]Sheet1!$A$5:$K$79,11,FALSE)","v":{"v":77,"d":"77.00"}},{"v":0.960797245607965,"d":"0.96"},{"v":73.9813879118133,"d":"73.98"}]
[167,"52003050146","陈亭竹","5201212******53822","影像科影像技术技师","C05","第二考场",{"$f":"VLOOKUP(C:C,[2]sheet1!$E$1:$F$65536,2,FALSE)","v":101},{"$f":"VLOOKUP(H:H,[4]Sheet1!$A$5:$I$76,9,FALSE)","v":{"v":70.6666666666667,"d":"70.67"}},{"v":1.04253796519585,"d":"1.04"},{"v":73.6726828738401,"d":"73.67"}]
[10,"52003050224","吴嫚","5224011******77642","影像科影像技术技师","C05","第一考场",{"$f":"VLOOKUP(C:C,[1]sheet1!$E$1:$F$65536,2,FALSE)","v":148},{"$f":"VLOOKUP(H:H,[3]Sheet1!$A$5:$K$79,11,FALSE)","v":{"v":76.6666666666667,"d":"76.67"}},{"v":0.960797245607965,"d":"0.96"},{"v":73.6611221632773,"d":"73.66"}]
[4,"52003050237","董超","5203271******56516","影像科影像技术技师","C05","第一考场",{"$f":"VLOOKUP(C:C,[1]sheet1!$E$1:$F$65536,2,FALSE)","v":104},{"$f":"VLOOKUP(H:H,[3]Sheet1!$A$5:$K$79,11,FALSE)","v":{"v":76.6666666666667,"d":"76.67"}},{"v":0.960797245607965,"d":"0.96"},{"v":73.6611221632773,"d":"73.66"}]
[29,"52003050070","何宇","5221261******15139","影像科影像技术技师","C05","第一考场",{"$f":"VLOOKUP(C:C,[1]sheet1!$E$1:$F$65536,2,FALSE)","v":139},{"$f":"VLOOKUP(H:H,[3]Sheet1!$A$5:$K$79,11,FALSE)","v":{"v":76.6666666666667,"d":"76.67"}},{"v":0.960797245607965,"d":"0.96"},{"v":73.6611221632773,"d":"73.66"}]
[126,"52003050129","周彬","5221311******3563X","影像科影像技术技师","C05","第一考场",{"$f":"VLOOKUP(C:C,[1]sheet1!$E$1:$F$65536,2,FALSE)","v":64},{"$f":"VLOOKUP(H:H,[3]Sheet1!$A$5:$K$79,11,FALSE)","v":{"v":76.6666666666667,"d":"76.67"}},{"v":0.960797245607965,"d":"0.96"},{"v":73.6611221632773,"d":"73.66"}]
[44,"52003050031","杜欣","5202211******59844","影像科影像技术技师","C05","第一考场",{"$f":"VLOOKUP(C:C,[1]sheet1!$E$1:$F$65536,2,FALSE)","v":71},{"$f":"VLOOKUP(H:H,[3]Sheet1!$A$5:$K$79,11,FALSE)","v":{"v":76.3333333333333,"d":"76.33"}},{"v":0.960797245607965,"d":"0.96"},{"v":73.3408564147413,"d":"73.34"}]
[258,"52003050194","陈小领","5225301******11747","影像科影像技术技师","C05","第二考场",{"$f":"VLOOKUP(C:C,[2]sheet1!$E$1:$F$65536,2,FALSE)","v":1},{"$f":"VLOOKUP(H:H,[4]Sheet1!$A$5:$I$76,9,FALSE)","v":{"v":70.3333333333333,"d":"70.33"}},{"v":1.04253796519585,"d":"1.04"},{"v":73.3251702187747,"d":"73.33"}]
[104,"52003050087","靳光瑞","5201031******91213","影像科影像技术技师","C05","第一考场",{"$f":"VLOOKUP(C:C,[1]sheet1!$E$1:$F$65536,2,FALSE)","v":137},{"$f":"VLOOKUP(H:H,[3]Sheet1!$A$5:$K$79,11,FALSE)","v":{"v":76,"d":"76.00"}},{"v":0.960797245607965,"d":"0.96"},{"v":73.0205906662053,"d":"73.02"}]
[48,"52003050085","简乐成","5222251******74871","影像科影像技术技师","C05","第一考场",{"$f":"VLOOKUP(C:C,[1]sheet1!$E$1:$F$65536,2,FALSE)","v":77},{"$f":"VLOOKUP(H:H,[3]Sheet1!$A$5:$K$79,11,FALSE)","v":{"v":76,"d":"76.00"}},{"v":0.960797245607965,"d":"0.96"},{"v":73.0205906662053,"d":"73.02"}]
[92,"52003050057","刘欣益","5221291******74549","影像科影像技术技师","C05","第一考场",{"$f":"VLOOKUP(C:C,[1]sheet1!$E$1:$F$65536,2,FALSE)","v":32},{"$f":"VLOOKUP(H:H,[3]Sheet1!$A$5:$K$79,11,FALSE)","v":{"v":76,"d":"76.00"}},{"v":0.960797245607965,"d":"0.96"},{"v":73.0205906662053,"d":"73.02"}]
[110,"52003050007","陈江涛","5221302******96013","影像科影像技术技师","C05","第一考场",{"$f":"VLOOKUP(C:C,[1]sheet1!$E$1:$F$65536,2,FALSE)","v":33},{"$f":"VLOOKUP(H:H,[3]Sheet1!$A$5:$K$79,11,FALSE)","v":{"v":76,"d":"76.00"}},{"v":0.960797245607965,"d":"0.96"},{"v":73.0205906662053,"d":"73.02"}]
[82,"52003050307","朱敏","5321281******01606","影像科影像技术技师","C05","第一考场",{"$f":"VLOOKUP(C:C,[1]sheet1!$E$1:$F$65536,2,FALSE)","v":14},{"$f":"VLOOKUP(H:H,[3]Sheet1!$A$5:$K$79,11,FALSE)","v":{"v":76,"d":"76.00"}},{"v":0.960797245607965,"d":"0.96"},{"v":73.0205906662053,"d":"73.02"}]
[278,"52003050250","罗通","5222241******04430","影像科影像技术技师","C05","第二考场",{"$f":"VLOOKUP(C:C,[2]sheet1!$E$1:$F$65536,2,FALSE)","v":11},{"$f":"VLOOKUP(H:H,[4]Sheet1!$A$5:$I$76,9,FALSE)","v":{"v":70,"d":"70.00"}},{"v":1.04253796519585,"d":"1.04"},{"v":72.9776575637095,"d":"72.98"}]
{"$rows_left_out":211}
{"sheet":"C06影像科信息网络工程师","index":1,"n_rows":9,"n_cols":9,"rows_kept":9}
["序号","报名序号","姓名","身份证号","岗位名称","岗位代码","抽签号","面试成绩","是否进入资格复审"]
[364,"52003060004","王裕龙","5221312******61511","影像科信息网络工程师","C06",{"$f":"VLOOKUP(C:C,[5]sheet1!$E$1:$F$65536,2,FALSE)","v":4},{"$f":"VLOOKUP(G:G,[6]Sheet1!$A:$I,9,FALSE)","v":{"v":80.3333333333333,"d":"80.33"}},"是"]
[367,"52003060024","李春","5224221******1322X","影像科信息网络工程师","C06",{"$f":"VLOOKUP(C:C,[5]sheet1!$E$1:$F$65536,2,FALSE)","v":6},{"$f":"VLOOKUP(G:G,[6]Sheet1!$A:$I,9,FALSE)","v":{"v":80,"d":"80.00"}}]
[361,"52003060002","李江虎","5225261******81010","影像科信息网络工程师","C06",{"$f":"VLOOKUP(C:C,[5]sheet1!$E$1:$F$65536,2,FALSE)","v":8},{"$f":"VLOOKUP(G:G,[6]Sheet1!$A:$I,9,FALSE)","v":{"v":78.6666666666667,"d":"78.67"}}]
[365,"52003060023","彭兵兵","5224252******00913","影像科信息网络工程师","C06",{"$f":"VLOOKUP(C:C,[5]sheet1!$E$1:$F$65536,2,FALSE)","v":2},{"$f":"VLOOKUP(G:G,[6]Sheet1!$A:$I,9,FALSE)","v":{"v":65,"d":"65.00"}}]
[360,"52003060012","王思博","5223211******30413","影像科信息网络工程师","C06",{"$f":"VLOOKUP(C:C,[5]sheet1!$E$1:$F$65536,2,FALSE)","v":5},{"$f":"VLOOKUP(G:G,[6]Sheet1!$A:$I,9,FALSE)","v":{"v":62,"d":"62.00"}}]
[362,"52003060022","马恒","5224271******6743X","影像科信息网络工程师","C06",{"$f":"VLOOKUP(C:C,[5]sheet1!$E$1:$F$65536,2,FALSE)","v":7},"缺考"]
[363,"52003060009","陈金良","5202021******52431","影像科信息网络工程师","C06",{"$f":"VLOOKUP(C:C,[5]sheet1!$E$1:$F$65536,2,FALSE)","v":1},"缺考"]
[366,"52003060006","路逊","5224281******13619","影像科信息网络工程师","C06",{"$f":"VLOOKUP(C:C,[5]sheet1!$E$1:$F$65536,2,FALSE)","v":3},"缺考"]