{"text_format":"3","workbook":"xlsx","n_sheets":6,"sheets":["急诊科院前急救医师A01","医学工程科管理岗C02","医务科医患关系管理岗C07","护理部导诊员岗C08","后勤科工程造价管理岗C10","后勤科综合管理岗C11"],"not_rendered":{"external_links":3,"defined_names":1},"read":"whole","date_system":"1900"}

{"sheet":"急诊科院前急救医师A01","index":0,"n_rows":16,"n_cols":9,"rows_kept":16}
["序号","报名序号","姓名","身份证号","岗位名称","岗位代码","抽签号","面试成绩","是否进入资格复审"]
[1,"52001010003","高前","522424****204891","急诊科院前急救医师","A01",10,{"v":85,"d":"85.00"},"是"]
[2,"52001010010","党新琳","520113****010822","急诊科院前急救医师","A01",11,{"v":84,"d":"84.00"},"是"]
[3,"52001010009","蔡英锐","520112****040013","急诊科院前急救医师","A01",8,81.33,"是"]
[4,"52001010013","罗吉发","522424****171016","急诊科院前急救医师","A01",4,{"v":81,"d":"81.00"},"是"]
[5,"52001010002","姚德伟","522122****185232","急诊科院前急救医师","A01",12,77.67]
[6,"52001010017","陈清梅","522324****020027","急诊科院前急救医师","A01",15,71.67]
[7,"52001010005","李艳平","522428****160660","急诊科院前急救医师","A01",null,"缺考"]
[8,"52001010008","舒杨","431228****211623","急诊科院前急救医师","A01",null,"缺考"]
[9,"52001010011","马乐乐","522225****115438","急诊科院前急救医师","A01",null,"缺考"]
[10,"52001010001","冯琳璐","522226****150126","急诊科院前急救医师","A01",null,"缺考"]
[11,"52001010019","李志翔","520121****06101X","急诊科院前急救医师","A01",null,"缺考"]
[12,"52001010004","吴贞章","522729****250019","急诊科院前急救医师","A01",null,"缺考"]
[13,"52001010006","田田","522123****271061","急诊科院前急救医师","A01",null,"缺考"]
[14,"52001010012","曾建松","522122****156013","急诊科院前急救医师","A01",null,"缺考"]
[15,"52001010007","宋明俭","522423****104383","急诊科院前急救医师","A01",null,"缺考"]

{"sheet":"医学工程科管理岗C02","index":1,"n_rows":47,"n_cols":9,"rows_kept":47}
["序号","报名序号","姓名","身份证号","岗位名称","岗位代码","抽签号","面试成绩","是否进入资格复审"]
[21,"52003020010","史登练","522423****171510","医学工程科管理岗","C02",{"$f":"VLOOKUP(C:C,[2]sheet1!$E$1:$F$65536,2,FALSE)","v":22},{"$f":"VLOOKUP(G:G,[3]Sheet1!$A:$K,11,FALSE)","v":93.67},"是"]
[33,"52003020022","王立海","522725****236811","医学工程科管理岗","C02",{"$f":"VLOOKUP(C:C,[2]sheet1!$E$1:$F$65536,2,FALSE)","v":33},{"$f":"VLOOKUP(G:G,[3]Sheet1!$A:$K,11,FALSE)","v":91.33},"是"]
[46,"52003020028","蒙玺光","522426****107773","医学工程科管理岗","C02",{"$f":"VLOOKUP(C:C,[2]sheet1!$E$1:$F$65536,2,FALSE)","v":11},{"$f":"VLOOKUP(G:G,[3]Sheet1!$A:$K,11,FALSE)","v":89.67},"是"]
[7,"52003020001","吴晓婷","522629****064822","医学工程科管理岗","C02",{"$f":"VLOOKUP(C:C,[2]sheet1!$E$1:$F$65536,2,FALSE)","v":6},{"$f":"VLOOKUP(G:G,[3]Sheet1!$A:$K,11,FALSE)","v":85.33}]
[40,"52003020049","张姗","511602****071549","医学工程科管理岗","C02",{"$f":"VLOOKUP(C:C,[2]sheet1!$E$1:$F$65536,2,FALSE)","v":26},{"$f":"VLOOKUP(G:G,[3]Sheet1!$A:$K,11,FALSE)","v":{"v":85,"d":"85.00"}}]
[13,"52003020002","龙雪娇","522226****260047","医学工程科管理岗","C02",{"$f":"VLOOKUP(C:C,[2]sheet1!$E$1:$F$65536,2,FALSE)","v":4},{"$f":"VLOOKUP(G:G,[3]Sheet1!$A:$K,11,FALSE)","v":75.33}]
[23,"52003020031","肖烨","522125****210027","医学工程科管理岗","C02",{"$f":"VLOOKUP(C:C,[2]sheet1!$E$1:$F$65536,2,FALSE)","v":27},{"$f":"VLOOKUP(G:G,[3]Sheet1!$A:$K,11,FALSE)","v":75.33}]
[37,"52003020005","张健明","522601****310021","医学工程科管理岗","C02",{"$f":"VLOOKUP(C:C,[2]sheet1!$E$1:$F$65536,2,FALSE)","v":19},{"$f":"VLOOKUP(G:G,[3]Sheet1!$A:$K,11,FALSE)","v":75.33}]
[36,"52003020046","黄雨","522122****256027","医学工程科管理岗","C02",{"$f":"VLOOKUP(C:C,[2]sheet1!$E$1:$F$65536,2,FALSE)","v":28},{"$f":"VLOOKUP(G:G,[3]Sheet1!$A:$K,11,FALSE)","v":74.67}]
[5,"52003020044","李永幸","522723****013325","医学工程科管理岗","C02",{"$f":"VLOOKUP(C:C,[2]sheet1!$E$1:$F$65536,2,FALSE)","v":43},{"$f":"VLOOKUP(G:G,[3]Sheet1!$A:$K,11,FALSE)","v":74.33}]
[3,"52003020016","黄嘉晗","522226****076486","医学工程科管理岗","C02",{"$f":"VLOOKUP(C:C,[2]sheet1!$E$1:$F$65536,2,FALSE)","v":15},{"$f":"VLOOKUP(G:G,[3]Sheet1!$A:$K,11,FALSE)","v":{"v":74,"d":"74.00"}}]
[4,"52003020014","刘宇琛","520181****020428","医学工程科管理岗","C02",{"$f":"VLOOKUP(C:C,[2]sheet1!$E$1:$F$65536,2,FALSE)","v":12},{"$f":"VLOOKUP(G:G,[3]Sheet1!$A:$K,11,FALSE)","v":{"v":74,"d":"74.00"}}]
[6,"52003020045","吴明姣","522631****10342X","医学工程科管理岗","C02",{"$f":"VLOOKUP(C:C,[2]sheet1!$E$1:$F$65536,2,FALSE)","v":10},{"$f":"VLOOKUP(G:G,[3]Sheet1!$A:$K,11,FALSE)","v":{"v":74,"d":"74.00"}}]
[24,"52003020030","樊小萍","522225****156623","医学工程科管理岗","C02",{"$f":"VLOOKUP(C:C,[2]sheet1!$E$1:$F$65536,2,FALSE)","v":24},{"$f":"VLOOKUP(G:G,[3]Sheet1!$A:$K,11,FALSE)","v":{"v":73,"d":"73.00"}}]
[19,"52003020007","金开飞","520203****255425","医学工程科管理岗","C02",{"$f":"VLOOKUP(C:C,[2]sheet1!$E$1:$F$65536,2,FALSE)","v":36},{"$f":"VLOOKUP(G:G,[3]Sheet1!$A:$K,11,FALSE)","v":72.67}]
[15,"52003020033","姚田","522625****23332X","医学工程科管理岗","C02",{"$f":"VLOOKUP(C:C,[2]sheet1!$E$1:$F$65536,2,FALSE)","v":37},{"$f":"VLOOKUP(G:G,[3]Sheet1!$A:$K,11,FALSE)","v":{"v":72,"d":"72.00"}}]
[39,"52003020034","祝丽","522124****160829","医学工程科管理岗","C02",{"$f":"VLOOKUP(C:C,[2]sheet1!$E$1:$F$65536,2,FALSE)","v":1},{"$f":"VLOOKUP(G:G,[3]Sheet1!$A:$K,11,FALSE)","v":71.33}]
[44,"52003020039","耿丽仙","530381****230528","医学工程科管理岗","C02",{"$f":"VLOOKUP(C:C,[2]sheet1!$E$1:$F$65536,2,FALSE)","v":7},{"$f":"VLOOKUP(G:G,[3]Sheet1!$A:$K,11,FALSE)","v":71.33}]
[31,"52003020054","彭洪兰","522130****240485","医学工程科管理岗","C02",{"$f":"VLOOKUP(C:C,[2]sheet1!$E$1:$F$65536,2,FALSE)","v":13},{"$f":"VLOOKUP(G:G,[3]Sheet1!$A:$K,11,FALSE)","v":{"v":71,"d":"71.00"}}]
[42,"52003020027","李双玲","522225****170068","医学工程科管理岗","C02",{"$f":"VLOOKUP(C:C,[2]sheet1!$E$1:$F$65536,2,FALSE)","v":17},{"$f":"VLOOKUP(G:G,[3]Sheet1!$A:$K,11,FALSE)","v":{"v":71,"d":"71.00"}}]
[17,"52003020029","杨丽虹","520102****124625","医学工程科管理岗","C02",{"$f":"VLOOKUP(C:C,[2]sheet1!$E$1:$F$65536,2,FALSE)","v":29},{"$f":"VLOOKUP(G:G,[3]Sheet1!$A:$K,11,FALSE)","v":70.67}]
[28,"52003020053","廖玙杰","513822****133208","医学工程科管理岗","C02",{"$f":"VLOOKUP(C:C,[2]sheet1!$E$1:$F$65536,2,FALSE)","v":25},{"$f":"VLOOKUP(G:G,[3]Sheet1!$A:$K,11,FALSE)","v":{"v":70,"d":"70.00"}}]
[45,"52003020042","陈梦瑜","500102****244301","医学工程科管理岗","C02",{"$f":"VLOOKUP(C:C,[2]sheet1!$E$1:$F$65536,2,FALSE)","v":31},{"$f":"VLOOKUP(G:G,[3]Sheet1!$A:$K,11,FALSE)","v":{"v":69,"d":"69.00"}}]
[1,"52003020008","刘红妹","522423****200047","医学工程科管理岗","C02",{"$f":"VLOOKUP(C:C,[2]sheet1!$E$1:$F$65536,2,FALSE)","v":30},{"$f":"VLOOKUP(G:G,[3]Sheet1!$A:$K,11,FALSE)","v":"缺考"}]
[2,"52003020003","陈艳","522426****130843","医学工程科管理岗","C02",{"$f":"VLOOKUP(C:C,[2]sheet1!$E$1:$F$65536,2,FALSE)","v":20},{"$f":"VLOOKUP(G:G,[3]Sheet1!$A:$K,11,FALSE)","v":"缺考"}]
[8,"52003020047","龙其刚","522123****102530","医学工程科管理岗","C02",{"$f":"VLOOKUP(C:C,[2]sheet1!$E$1:$F$65536,2,FALSE)","v":42},{"$f":"VLOOKUP(G:G,[3]Sheet1!$A:$K,11,FALSE)","v":"缺考"}]
[9,"52003020012","陈奎锦","522327****020019","医学工程科管理岗","C02",{"$f":"VLOOKUP(C:C,[2]sheet1!$E$1:$F$65536,2,FALSE)","v":46},{"$f":"VLOOKUP(G:G,[3]Sheet1!$A:$K,11,FALSE)","v":"缺考"}]
[10,"52003020025","阮文俊","522224****284457","医学工程科管理岗","C02",{"$f":"VLOOKUP(C:C,[2]sheet1!$E$1:$F$65536,2,FALSE)","v":5},{"$f":"VLOOKUP(G:G,[3]Sheet1!$A:$K,11,FALSE)","v":"缺考"}]
[11,"52003020050","杨敏","522424****120423","医学工程科管理岗","C02",{"$f":"VLOOKUP(C:C,[2]sheet1!$E$1:$F$65536,2,FALSE)","v":21},{"$f":"VLOOKUP(G:G,[3]Sheet1!$A:$K,11,FALSE)","v":"缺考"}]
{"$rows_left_out":18}
{"sheet":"医务科医患关系管理岗C07","index":2,"n_rows":8,"n_cols":9,"rows_kept":8}
["序号","报名序号","姓名","身份证号","岗位名称","岗位代码","抽签号","面试成绩","是否进入资格复审"]
[1,"52003070004","罗丞佑","522723****120212","医务科医患关系管理岗","C07",4,87.67,"是"]
[2,"52003070011","曾劲源","522526****023616","医务科医患关系管理岗","C07",6,{"v":86,"d":"86.00"},"是"]
[3,"52003110064","王宇","520181****011713","医务科医患关系管理岗","C07",1,78.33]
[4,"52003070001","马鹏成","520181****250813","医务科医患关系管理岗","C07",3,72.33]
[5,"52003070010","杜睿","522725****07612X","医务科医患关系管理岗","C07",7,67.33]
[6,"52003070006","马飞","520181****183318","医务科医患关系管理岗","C07",null,"缺考"]
[7,"52003070012","陈祎玲","522221****064924","医务科医患关系管理岗","C07",null,"缺考"]

{"sheet":"护理部导诊员岗C08","index":3,"n_rows":274,"n_cols":12,"rows_kept":274}
["序号","报名序号","姓名","身份证号","岗位名称","岗位代码","考场号","抽签号","面试原始成绩","修正系数","最终面试成绩","是否进入资格复审"]
[1,"52003080233","申霖露","522126****027023","护理部导诊员","C08",{"$f":"VLOOKUP(C:C,[1]汇总得分!$B:$D,3,FALSE)","v":"第一考场"},{"$f":"VLOOKUP(C:C,[1]汇总得分!$B:$C,2,FALSE)","v":19},{"$f":"VLOOKUP(C:C,[1]汇总得分!$E:$G,3,FALSE)","v":{"v":93,"d":"93.00"}},{"$f":"VLOOKUP(C:C,[1]汇总得分!$E:$H,4,FALSE)","v":{"v":1.0402,"d":"1.04"}},{"$f":"VLOOKUP(C:C,[1]汇总得分!$E:$I,5,FALSE)","v":{"v":96.7386,"d":"96.74"}},"是"]
[2,"52003080186","田盈盈","520321****043869","护理部导诊员","C08",{"$f":"VLOOKUP(C:C,[1]汇总得分!$B:$D,3,FALSE)","v":"第一考场"},{"$f":"VLOOKUP(C:C,[1]汇总得分!$B:$C,2,FALSE)","v":78},{"$f":"VLOOKUP(C:C,[1]汇总得分!$E:$G,3,FALSE)","v":{"v":92,"d":"92.00"}},{"$f":"VLOOKUP(C:C,[1]汇总得分!$E:$H,4,FALSE)","v":{"v":1.0402,"d":"1.04"}},{"$f":"VLOOKUP(C:C,[1]汇总得分!$E:$I,5,FALSE)","v":{"v":95.6984,"d":"95.70"}},"是"]
[3,"52003080304","袁蒙","522121****166227","护理部导诊员","C08",{"$f":"VLOOKUP(C:C,[1]汇总得分!$B:$D,3,FALSE)","v":"第二考场"},{"$f":"VLOOKUP(C:C,[1]汇总得分!$B:$C,2,FALSE)","v":8},{"$f":"VLOOKUP(C:C,[1]汇总得分!$E:$G,3,FALSE)","v":{"v":96,"d":"96.00"}},{"$f":"VLOOKUP(C:C,[1]汇总得分!$E:$H,4,FALSE)","v":{"v":0.97072239467203,"d":"0.97"}},{"$f":"VLOOKUP(C:C,[1]汇总得分!$E:$I,5,FALSE)","v":{"v":93.1893498885149,"d":"93.19"}},"是"]
[4,"52003080115","田畅业","522226****260043","护理部导诊员","C08",{"$f":"VLOOKUP(C:C,[1]汇总得分!$B:$D,3,FALSE)","v":"第一考场"},{"$f":"VLOOKUP(C:C,[1]汇总得分!$B:$C,2,FALSE)","v":4},{"$f":"VLOOKUP(C:C,[1]汇总得分!$E:$G,3,FALSE)","v":{"v":89,"d":"89.00"}},{"$f":"VLOOKUP(C:C,[1]汇总得分!$E:$H,4,FALSE)","v":{"v":1.0402,"d":"1.04"}},{"$f":"VLOOKUP(C:C,[1]汇总得分!$E:$I,5,FALSE)","v":{"v":92.5778,"d":"92.58"}},"是"]
[5,"52003080089","李琪瑶","520112****270021","护理部导诊员","C08",{"$f":"VLOOKUP(C:C,[1]汇总得分!$B:$D,3,FALSE)","v":"第二考场"},{"$f":"VLOOKUP(C:C,[1]汇总得分!$B:$C,2,FALSE)","v":131},{"$f":"VLOOKUP(C:C,[1]汇总得分!$E:$G,3,FALSE)","v":{"v":94.6666666666667,"d":"94.67"}},{"$f":"VLOOKUP(C:C,[1]汇总得分!$E:$H,4,FALSE)","v":{"v":0.97072239467203,"d":"0.97"}},{"$f":"VLOOKUP(C:C,[1]汇总得分!$E:$I,5,FALSE)","v":{"v":91.8950533622855,"d":"91.90"}},"是"]
[6,"52003080031","李明洁","522422****033221","护理部导诊员","C08",{"$f":"VLOOKUP(C:C,[1]汇总得分!$B:$D,3,FALSE)","v":"第二考场"},{"$f":"VLOOKUP(C:C,[1]汇总得分!$B:$C,2,FALSE)","v":33},{"$f":"VLOOKUP(C:C,[1]汇总得分!$E:$G,3,FALSE)","v":{"v":94,"d":"94.00"}},{"$f":"VLOOKUP(C:C,[1]汇总得分!$E:$H,4,FALSE)","v":{"v":0.97072239467203,"d":"0.97"}},{"$f":"VLOOKUP(C:C,[1]汇总得分!$E:$I,5,FALSE)","v":{"v":91.2479050991708,"d":"91.25"}},"是"]
[7,"52003080026","罗江丽","522225****023627","护理部导诊员","C08",{"$f":"VLOOKUP(C:C,[1]汇总得分!$B:$D,3,FALSE)","v":"第一考场"},{"$f":"VLOOKUP(C:C,[1]汇总得分!$B:$C,2,FALSE)","v":38},{"$f":"VLOOKUP(C:C,[1]汇总得分!$E:$G,3,FALSE)","v":{"v":87.3333333333333,"d":"87.33"}},{"$f":"VLOOKUP(C:C,[1]汇总得分!$E:$H,4,FALSE)","v":{"v":1.0402,"d":"1.04"}},{"$f":"VLOOKUP(C:C,[1]汇总得分!$E:$I,5,FALSE)","v":{"v":90.8441333333333,"d":"90.84"}},"是"]
[8,"52003080004","付丽","522127****092523","护理部导诊员","C08",{"$f":"VLOOKUP(C:C,[1]汇总得分!$B:$D,3,FALSE)","v":"第一考场"},{"$f":"VLOOKUP(C:C,[1]汇总得分!$B:$C,2,FALSE)","v":109},{"$f":"VLOOKUP(C:C,[1]汇总得分!$E:$G,3,FALSE)","v":{"v":87,"d":"87.00"}},{"$f":"VLOOKUP(C:C,[1]汇总得分!$E:$H,4,FALSE)","v":{"v":1.0402,"d":"1.04"}},{"$f":"VLOOKUP(C:C,[1]汇总得分!$E:$I,5,FALSE)","v":{"v":90.4974,"d":"90.50"}},"是"]
[9,"52003080013","陈佳兰","522130****216024","护理部导诊员","C08",{"$f":"VLOOKUP(C:C,[1]汇总得分!$B:$D,3,FALSE)","v":"第二考场"},{"$f":"VLOOKUP(C:C,[1]汇总得分!$B:$C,2,FALSE)","v":122},{"$f":"VLOOKUP(C:C,[1]汇总得分!$E:$G,3,FALSE)","v":{"v":93,"d":"93.00"}},{"$f":"VLOOKUP(C:C,[1]汇总得分!$E:$H,4,FALSE)","v":{"v":0.97072239467203,"d":"0.97"}},{"$f":"VLOOKUP(C:C,[1]汇总得分!$E:$I,5,FALSE)","v":{"v":90.2771827044988,"d":"90.28"}},"是"]
[10,"52003080054","何喜婷","522121****132641","护理部导诊员","C08",{"$f":"VLOOKUP(C:C,[1]汇总得分!$B:$D,3,FALSE)","v":"第二考场"},{"$f":"VLOOKUP(C:C,[1]汇总得分!$B:$C,2,FALSE)","v":65},{"$f":"VLOOKUP(C:C,[1]汇总得分!$E:$G,3,FALSE)","v":{"v":92,"d":"92.00"}},{"$f":"VLOOKUP(C:C,[1]汇总得分!$E:$H,4,FALSE)","v":{"v":0.97072239467203,"d":"0.97"}},{"$f":"VLOOKUP(C:C,[1]汇总得分!$E:$I,5,FALSE)","v":{"v":89.3064603098268,"d":"89.31"}},"是"]
[11,"52003080150","晏换","522428****214446","护理部导诊员","C08",{"$f":"VLOOKUP(C:C,[1]汇总得分!$B:$D,3,FALSE)","v":"第二考场"},{"$f":"VLOOKUP(C:C,[1]汇总得分!$B:$C,2,FALSE)","v":127},{"$f":"VLOOKUP(C:C,[1]汇总得分!$E:$G,3,FALSE)","v":{"v":91.3333333333333,"d":"91.33"}},{"$f":"VLOOKUP(C:C,[1]汇总得分!$E:$H,4,FALSE)","v":{"v":0.97072239467203,"d":"0.97"}},{"$f":"VLOOKUP(C:C,[1]汇总得分!$E:$I,5,FALSE)","v":{"v":88.659312046712,"d":"88.66"}},"是"]
[12,"52003080008","鲁莎","532128****050389","护理部导诊员","C08",{"$f":"VLOOKUP(C:C,[1]汇总得分!$B:$D,3,FALSE)","v":"第二考场"},{"$f":"VLOOKUP(C:C,[1]汇总得分!$B:$C,2,FALSE)","v":80},{"$f":"VLOOKUP(C:C,[1]汇总得分!$E:$G,3,FALSE)","v":{"v":91,"d":"91.00"}},{"$f":"VLOOKUP(C:C,[1]汇总得分!$E:$H,4,FALSE)","v":{"v":0.97072239467203,"d":"0.97"}},{"$f":"VLOOKUP(C:C,[1]汇总得分!$E:$I,5,FALSE)","v":{"v":88.3357379151547,"d":"88.34"}},"是"]
[13,"52003080148","文萍","522122****231827","护理部导诊员","C08",{"$f":"VLOOKUP(C:C,[1]汇总得分!$B:$D,3,FALSE)","v":"第二考场"},{"$f":"VLOOKUP(C:C,[1]汇总得分!$B:$C,2,FALSE)","v":85},{"$f":"VLOOKUP(C:C,[1]汇总得分!$E:$G,3,FALSE)","v":{"v":90.6666666666667,"d":"90.67"}},{"$f":"VLOOKUP(C:C,[1]汇总得分!$E:$H,4,FALSE)","v":{"v":0.97072239467203,"d":"0.97"}},{"$f":"VLOOKUP(C:C,[1]汇总得分!$E:$I,5,FALSE)","v":{"v":88.0121637835974,"d":"88.01"}},"是"]
[14,"52003080018","唐洁","520112****201124","护理部导诊员","C08",{"$f":"VLOOKUP(C:C,[1]汇总得分!$B:$D,3,FALSE)","v":"第二考场"},{"$f":"VLOOKUP(C:C,[1]汇总得分!$B:$C,2,FALSE)","v":135},{"$f":"VLOOKUP(C:C,[1]汇总得分!$E:$G,3,FALSE)","v":{"v":90.6666666666667,"d":"90.67"}},{"$f":"VLOOKUP(C:C,[1]汇总得分!$E:$H,4,FALSE)","v":{"v":0.97072239467203,"d":"0.97"}},{"$f":"VLOOKUP(C:C,[1]汇总得分!$E:$I,5,FALSE)","v":{"v":88.0121637835974,"d":"88.01"}},"是"]
[15,"52003080051","王硕","522130****107215","护理部导诊员","C08",{"$f":"VLOOKUP(C:C,[1]汇总得分!$B:$D,3,FALSE)","v":"第二考场"},{"$f":"VLOOKUP(C:C,[1]汇总得分!$B:$C,2,FALSE)","v":104},{"$f":"VLOOKUP(C:C,[1]汇总得分!$E:$G,3,FALSE)","v":{"v":90.3333333333333,"d":"90.33"}},{"$f":"VLOOKUP(C:C,[1]汇总得分!$E:$H,4,FALSE)","v":{"v":0.97072239467203,"d":"0.97"}},{"$f":"VLOOKUP(C:C,[1]汇总得分!$E:$I,5,FALSE)","v":{"v":87.68858965204,"d":"87.69"}},"是"]
[16,"52003080024","李韩玥","520121****073442","护理部导诊员","C08",{"$f":"VLOOKUP(C:C,[1]汇总得分!$B:$D,3,FALSE)","v":"第二考场"},{"$f":"VLOOKUP(C:C,[1]汇总得分!$B:$C,2,FALSE)","v":76},{"$f":"VLOOKUP(C:C,[1]汇总得分!$E:$G,3,FALSE)","v":{"v":88.6666666666667,"d":"88.67"}},{"$f":"VLOOKUP(C:C,[1]汇总得分!$E:$H,4,FALSE)","v":{"v":0.97072239467203,"d":"0.97"}},{"$f":"VLOOKUP(C:C,[1]汇总得分!$E:$I,5,FALSE)","v":{"v":86.0707189942534,"d":"86.07"}},"是"]
[17,"52003080288","金倩","522122****081828","护理部导诊员","C08",{"$f":"VLOOKUP(C:C,[1]汇总得分!$B:$D,3,FALSE)","v":"第二考场"},{"$f":"VLOOKUP(C:C,[1]汇总得分!$B:$C,2,FALSE)","v":112},{"$f":"VLOOKUP(C:C,[1]汇总得分!$E:$G,3,FALSE)","v":{"v":87.3333333333333,"d":"87.33"}},{"$f":"VLOOKUP(C:C,[1]汇总得分!$E:$H,4,FALSE)","v":{"v":0.97072239467203,"d":"0.97"}},{"$f":"VLOOKUP(C:C,[1]汇总得分!$E:$I,5,FALSE)","v":{"v":84.7764224680239,"d":"84.78"}},"是"]
[18,"52003080276","翟崧堉","522401****090240","护理部导诊员","C08",{"$f":"VLOOKUP(C:C,[1]汇总得分!$B:$D,3,FALSE)","v":"第二考场"},{"$f":"VLOOKUP(C:C,[1]汇总得分!$B:$C,2,FALSE)","v":42},{"$f":"VLOOKUP(C:C,[1]汇总得分!$E:$G,3,FALSE)","v":{"v":86.3333333333333,"d":"86.33"}},{"$f":"VLOOKUP(C:C,[1]汇总得分!$E:$H,4,FALSE)","v":{"v":0.97072239467203,"d":"0.97"}},{"$f":"VLOOKUP(C:C,[1]汇总得分!$E:$I,5,FALSE)","v":{"v":83.8057000733519,"d":"83.81"}},"是"]
[19,"52003080314","龙优情","522229****104024","护理部导诊员","C08",{"$f":"VLOOKUP(C:C,[1]汇总得分!$B:$D,3,FALSE)","v":"第一考场"},{"$f":"VLOOKUP(C:C,[1]汇总得分!$B:$C,2,FALSE)","v":6},{"$f":"VLOOKUP(C:C,[1]汇总得分!$E:$G,3,FALSE)","v":{"v":80,"d":"80.00"}},{"$f":"VLOOKUP(C:C,[1]汇总得分!$E:$H,4,FALSE)","v":{"v":1.0402,"d":"1.04"}},{"$f":"VLOOKUP(C:C,[1]汇总得分!$E:$I,5,FALSE)","v":{"v":83.216,"d":"83.22"}}]
[20,"52003080123","朱雨梅","522425****105422","护理部导诊员","C08",{"$f":"VLOOKUP(C:C,[1]汇总得分!$B:$D,3,FALSE)","v":"第二考场"},{"$f":"VLOOKUP(C:C,[1]汇总得分!$B:$C,2,FALSE)","v":120},{"$f":"VLOOKUP(C:C,[1]汇总得分!$E:$G,3,FALSE)","v":{"v":85,"d":"85.00"}},{"$f":"VLOOKUP(C:C,[1]汇总得分!$E:$H,4,FALSE)","v":{"v":0.97072239467203,"d":"0.97"}},{"$f":"VLOOKUP(C:C,[1]汇总得分!$E:$I,5,FALSE)","v":{"v":82.5114035471226,"d":"82.51"}}]
[21,"52003080098","龙姣","522426****108269","护理部导诊员","C08",{"$f":"VLOOKUP(C:C,[1]汇总得分!$B:$D,3,FALSE)","v":"第二考场"},{"$f":"VLOOKUP(C:C,[1]汇总得分!$B:$C,2,FALSE)","v":44},{"$f":"VLOOKUP(C:C,[1]汇总得分!$E:$G,3,FALSE)","v":{"v":78,"d":"78.00"}},{"$f":"VLOOKUP(C:C,[1]汇总得分!$E:$H,4,FALSE)","v":{"v":0.97072239467203,"d":"0.97"}},{"$f":"VLOOKUP(C:C,[1]汇总得分!$E:$I,5,FALSE)","v":{"v":75.7163467844183,"d":"75.72"}}]
[22,"52003080143","李静","522128****290044","护理部导诊员","C08",{"$f":"VLOOKUP(C:C,[1]汇总得分!$B:$D,3,FALSE)","v":"第二考场"},{"$f":"VLOOKUP(C:C,[1]汇总得分!$B:$C,2,FALSE)","v":74},{"$f":"VLOOKUP(C:C,[1]汇总得分!$E:$G,3,FALSE)","v":{"v":77,"d":"77.00"}},{"$f":"VLOOKUP(C:C,[1]汇总得分!$E:$H,4,FALSE)","v":{"v":0.97072239467203,"d":"0.97"}},{"$f":"VLOOKUP(C:C,[1]汇总得分!$E:$I,5,FALSE)","v":{"v":74.7456243897463,"d":"74.75"}}]
[23,"52003080009","杨杞","522223****110043","护理部导诊员","C08",{"$f":"VLOOKUP(C:C,[1]汇总得分!$B:$D,3,FALSE)","v":"第一考场"},{"$f":"VLOOKUP(C:C,[1]汇总得分!$B:$C,2,FALSE)","v":71},{"$f":"VLOOKUP(C:C,[1]汇总得分!$E:$G,3,FALSE)","v":{"v":71.6666666666667,"d":"71.67"}},{"$f":"VLOOKUP(C:C,[1]汇总得分!$E:$H,4,FALSE)","v":{"v":1.0402,"d":"1.04"}},{"$f":"VLOOKUP(C:C,[1]汇总得分!$E:$I,5,FALSE)","v":{"v":74.5476666666667,"d":"74.55"}}]
[24,"52003080212","刘艳琼","522624****280044","护理部导诊员","C08",{"$f":"VLOOKUP(C:C,[1]汇总得分!$B:$D,3,FALSE)","v":"第一考场"},{"$f":"VLOOKUP(C:C,[1]汇总得分!$B:$C,2,FALSE)","v":26},{"$f":"VLOOKUP(C:C,[1]汇总得分!$E:$G,3,FALSE)","v":{"v":70.6666666666667,"d":"70.67"}},{"$f":"VLOOKUP(C:C,[1]汇总得分!$E:$H,4,FALSE)","v":{"v":1.0402,"d":"1.04"}},{"$f":"VLOOKUP(C:C,[1]汇总得分!$E:$I,5,FALSE)","v":{"v":73.5074666666667,"d":"73.51"}}]
[25,"52003080270","龙腾森","522628****203014","护理部导诊员","C08",{"$f":"VLOOKUP(C:C,[1]汇总得分!$B:$D,3,FALSE)","v":"第一考场"},{"$f":"VLOOKUP(C:C,[1]汇总得分!$B:$C,2,FALSE)","v":46},{"$f":"VLOOKUP(C:C,[1]汇总得分!$E:$G,3,FALSE)","v":{"v":70.6666666666667,"d":"70.67"}},{"$f":"VLOOKUP(C:C,[1]汇总得分!$E:$H,4,FALSE)","v":{"v":1.0402,"d":"1.04"}},{"$f":"VLOOKUP(C:C,[1]汇总得分!$E:$I,5,FALSE)","v":{"v":73.5074666666667,"d":"73.51"}}]
[26,"52003080216","李玉兰","522423****170423","护理部导诊员","C08",{"$f":"VLOOKUP(C:C,[1]汇总得分!$B:$D,3,FALSE)","v":"第一考场"},{"$f":"VLOOKUP(C:C,[1]汇总得分!$B:$C,2,FALSE)","v":28},{"$f":"VLOOKUP(C:C,[1]汇总得分!$E:$G,3,FALSE)","v":{"v":70.6666666666667,"d":"70.67"}},{"$f":"VLOOKUP(C:C,[1]汇总得分!$E:$H,4,FALSE)","v":{"v":1.0402,"d":"1.04"}},{"$f":"VLOOKUP(C:C,[1]汇总得分!$E:$I,5,FALSE)","v":{"v":73.5074666666667,"d":"73.51"}}]
[27,"52003080221","张正敏","522121****230441","护理部导诊员","C08",{"$f":"VLOOKUP(C:C,[1]汇总得分!$B:$D,3,FALSE)","v":"第一考场"},{"$f":"VLOOKUP(C:C,[1]汇总得分!$B:$C,2,FALSE)","v":58},{"$f":"VLOOKUP(C:C,[1]汇总得分!$E:$G,3,FALSE)","v":{"v":70.3333333333333,"d":"70.33"}},{"$f":"VLOOKUP(C:C,[1]汇总得分!$E:$H,4,FALSE)","v":{"v":1.0402,"d":"1.04"}},{"$f":"VLOOKUP(C:C,[1]汇总得分!$E:$I,5,FALSE)","v":{"v":73.1607333333333,"d":"73.16"}}]
[28,"52003080317","龙沛伊","431302****024105","护理部导诊员","C08",{"$f":"VLOOKUP(C:C,[1]汇总得分!$B:$D,3,FALSE)","v":"第一考场"},{"$f":"VLOOKUP(C:C,[1]汇总得分!$B:$C,2,FALSE)","v":10},{"$f":"VLOOKUP(C:C,[1]汇总得分!$E:$G,3,FALSE)","v":{"v":70.3333333333333,"d":"70.33"}},{"$f":"VLOOKUP(C:C,[1]汇总得分!$E:$H,4,FALSE)","v":{"v":1.0402,"d":"1.04"}},{"$f":"VLOOKUP(C:C,[1]汇总得分!$E:$I,5,FALSE)","v":{"v":73.1607333333333,"d":"73.16"}}]
[29,"52003080284","宋卓琼","522228****24044X","护理部导诊员","C08",{"$f":"VLOOKUP(C:C,[1]汇总得分!$B:$D,3,FALSE)","v":"第一考场"},{"$f":"VLOOKUP(C:C,[1]汇总得分!$B:$C,2,FALSE)","v":27},{"$f":"VLOOKUP(C:C,[1]汇总得分!$E:$G,3,FALSE)","v":{"v":70.3333333333333,"d":"70.33"}},{"$f":"VLOOKUP(C:C,[1]汇总得分!$E:$H,4,FALSE)","v":{"v":1.0402,"d":"1.04"}},{"$f":"VLOOKUP(C:C,[1]汇总得分!$E:$I,5,FALSE)","v":{"v":73.1607333333333,"d":"73.16"}}]
{"$rows_left_out":245}
{"sheet":"后勤科工程造价管理岗C10","index":4,"n_rows":8,"n_cols":9,"rows_kept":8}
["序号","报名序号","姓名","身份证号","岗位名称","岗位代码","抽签号","面试成绩","是否进入资格复审"]
[1,"52003100009","杨天雯静","5201021****62427","后勤科工程造价管理岗","C10",4,88.33,"是"]
[2,"52003100005","赵洪成","5116021****6509X","后勤科工程造价管理岗","C10",6,{"v":87,"d":"87.00"}]
[3,"52003100001","李航","5221211****52672","后勤科工程造价管理岗","C10",5,76.33]
[4,"52003100033","樊国陆","5224011****43215","后勤科工程造价管理岗","C10",1,71.67]
[5,"52003100019","安晓丽","5224231****34022","后勤科工程造价管理岗","C10",7,71.33]
[6,"52003100028","刘桂坊","5201121****02842","后勤科工程造价管理岗","C10",null,"缺考"]
[7,"52003100034","龙焕梅","5226311****69220","后勤科工程造价管理岗","C10",null,"缺考"]

{"sheet":"后勤科综合管理岗C11","index":5,"n_rows":23,"n_cols":9,"rows_kept":23}
["序号","报名序号","姓名","身份证号","岗位名称","岗位代码","抽签号","面试成绩","是否进入资格复审"]
[1,"52003110016","申圆圆","522126****187016","后勤科综合管理岗","C11",13,88.66,"是"]
[2,"52003110017","张万超","522501****085268","后勤科综合管理岗","C11",24,{"v":88,"d":"88.00"},"是"]
[3,"52003110012","贺延芳","520121****253841","后勤科综合管理岗","C11",16,{"v":80,"d":"80.00"}]
[4,"52003110024","吴晗","522128****122538","后勤科综合管理岗","C11",9,77.66]
[5,"52003110058","李海境","522422****270826","后勤科综合管理岗","C11",22,77.66]
[6,"52003110049","郭俊","522729****190012","后勤科综合管理岗","C11",8,76.33]
[7,"52003110028","朱亮","522501****124630","后勤科综合管理岗","C11",27,{"v":76,"d":"76.00"}]
[8,"52003110041","梁蓉蓉","520421****162221","后勤科综合管理岗","C11",29,{"v":75,"d":"75.00"}]
[9,"52003110001","赵志鑫","520123****051217","后勤科综合管理岗","C11",21,74.33]
[10,"52003110053","王力","520121****262817","后勤科综合管理岗","C11",10,{"v":74,"d":"74.00"}]
[11,"52003110015","李娇","522427****033765","后勤科综合管理岗","C11",25,{"v":74,"d":"74.00"}]
[12,"52003110044","陈晓萍","522501****242023","后勤科综合管理岗","C11",17,73.66]
[13,"52003110004","叶蒸富","522129****235019","后勤科综合管理岗","C11",14,73.33]
[14,"52003110022","安倩颖","522221****191248","后勤科综合管理岗","C11",23,{"v":70,"d":"70.00"}]
[15,"52003110077","田姣姣","522630****170484","后勤科综合管理岗","C11",null,"缺考"]
[16,"52003110073","丁成辰","522401****176428","后勤科综合管理岗","C11",null,"缺考"]
[17,"52003110069","陈玮","522101****156413","后勤科综合管理岗","C11",null,"缺考"]
[18,"52003110031","何卓怡","522427****111110","后勤科综合管理岗","C11",null,"缺考"]
[19,"52003110056","何秋霖","520221****151820","后勤科综合管理岗","C11",null,"缺考"]
[20,"52003110020","高小芬","520425****219921","后勤科综合管理岗","C11",null,"缺考"]
[21,"52003110021","李静","522129****220025","后勤科综合管理岗","C11",null,"缺考"]
[22,"52003110068","甘舰","522224****182012","后勤科综合管理岗","C11",null,"缺考"]