{"text_format":"3","workbook":"xlsx","n_sheets":2,"sheets":["Sheet2","Sheet3"],"not_rendered":{"external_links":1,"defined_names":3},"read":"whole","date_system":"1900"}

{"sheet":"Sheet2","index":0,"n_rows":1933,"n_cols":9,"rows_kept":1933,"merged":[[0,0,0,8]]}
["松桃苗族自治县2023年“特岗计划”教师招聘考试笔试成绩"]
["序号","姓名","准考证号","考场号","座位号","报名号","报考学段","报考学科","笔试成绩"]
[1,"吴爱连",20230603010101,"01","01",2460,{"$f":"VLOOKUP(F3,[1]总表!$A$3:$AF$30000,31,FALSE)","v":"初中"},{"$f":"VLOOKUP(F3,[1]总表!$A$3:$AF$30000,32,FALSE)","v":"语文"},"56"]
[2,"田杨",20230603010102,"01","02",2565,{"$f":"VLOOKUP(F4,[1]总表!$A$3:$AF$30000,31,FALSE)","v":"初中"},{"$f":"VLOOKUP(F4,[1]总表!$A$3:$AF$30000,32,FALSE)","v":"语文"},"55"]
[3,"葛茂婕",20230603010103,"01","03",2485,{"$f":"VLOOKUP(F5,[1]总表!$A$3:$AF$30000,31,FALSE)","v":"初中"},{"$f":"VLOOKUP(F5,[1]总表!$A$3:$AF$30000,32,FALSE)","v":"语文"},"63.50"]
[4,"罗婷婷",20230603010104,"01","04",2524,{"$f":"VLOOKUP(F6,[1]总表!$A$3:$AF$30000,31,FALSE)","v":"初中"},{"$f":"VLOOKUP(F6,[1]总表!$A$3:$AF$30000,32,FALSE)","v":"语文"},"62.50"]
[5,"尹海南",20230603010105,"01","05",1952,{"$f":"VLOOKUP(F7,[1]总表!$A$3:$AF$30000,31,FALSE)","v":"初中"},{"$f":"VLOOKUP(F7,[1]总表!$A$3:$AF$30000,32,FALSE)","v":"语文"},"缺考"]
[6,"田海霞",20230603010106,"01","06",2415,{"$f":"VLOOKUP(F8,[1]总表!$A$3:$AF$30000,31,FALSE)","v":"初中"},{"$f":"VLOOKUP(F8,[1]总表!$A$3:$AF$30000,32,FALSE)","v":"语文"},"70.50"]
[7,"杨艳",20230603010107,"01","07",1986,{"$f":"VLOOKUP(F9,[1]总表!$A$3:$AF$30000,31,FALSE)","v":"初中"},{"$f":"VLOOKUP(F9,[1]总表!$A$3:$AF$30000,32,FALSE)","v":"语文"},"54.50"]
[8,"陆芳林",20230603010108,"01","08",2318,{"$f":"VLOOKUP(F10,[1]总表!$A$3:$AF$30000,31,FALSE)","v":"初中"},{"$f":"VLOOKUP(F10,[1]总表!$A$3:$AF$30000,32,FALSE)","v":"语文"},"57.50"]
[9,"刘芬",20230603010109,"01","09",2367,{"$f":"VLOOKUP(F11,[1]总表!$A$3:$AF$30000,31,FALSE)","v":"初中"},{"$f":"VLOOKUP(F11,[1]总表!$A$3:$AF$30000,32,FALSE)","v":"语文"},"51"]
[10,"邹玉茹",20230603010110,"01","10",2452,{"$f":"VLOOKUP(F12,[1]总表!$A$3:$AF$30000,31,FALSE)","v":"初中"},{"$f":"VLOOKUP(F12,[1]总表!$A$3:$AF$30000,32,FALSE)","v":"语文"},"59"]
[11,"彭颖",20230603010111,"01","11",2542,{"$f":"VLOOKUP(F13,[1]总表!$A$3:$AF$30000,31,FALSE)","v":"初中"},{"$f":"VLOOKUP(F13,[1]总表!$A$3:$AF$30000,32,FALSE)","v":"语文"},"49.50"]
[12,"涂琴",20230603010112,"01","12",2584,{"$f":"VLOOKUP(F14,[1]总表!$A$3:$AF$30000,31,FALSE)","v":"初中"},{"$f":"VLOOKUP(F14,[1]总表!$A$3:$AF$30000,32,FALSE)","v":"语文"},"53"]
[13,"吴晗鹏",20230603010113,"01","13",2023,{"$f":"VLOOKUP(F15,[1]总表!$A$3:$AF$30000,31,FALSE)","v":"初中"},{"$f":"VLOOKUP(F15,[1]总表!$A$3:$AF$30000,32,FALSE)","v":"语文"},"56.50"]
[14,"殷美玲",20230603010114,"01","14",2055,{"$f":"VLOOKUP(F16,[1]总表!$A$3:$AF$30000,31,FALSE)","v":"初中"},{"$f":"VLOOKUP(F16,[1]总表!$A$3:$AF$30000,32,FALSE)","v":"语文"},"60"]
[15,"杨玉蓉",20230603010115,"01","15",2044,{"$f":"VLOOKUP(F17,[1]总表!$A$3:$AF$30000,31,FALSE)","v":"初中"},{"$f":"VLOOKUP(F17,[1]总表!$A$3:$AF$30000,32,FALSE)","v":"语文"},"61.50"]
[16,"谭蓉",20230603010116,"01","16",2420,{"$f":"VLOOKUP(F18,[1]总表!$A$3:$AF$30000,31,FALSE)","v":"初中"},{"$f":"VLOOKUP(F18,[1]总表!$A$3:$AF$30000,32,FALSE)","v":"语文"},"65.50"]
[17,"殷婧帆",20230603010117,"01","17",2034,{"$f":"VLOOKUP(F19,[1]总表!$A$3:$AF$30000,31,FALSE)","v":"初中"},{"$f":"VLOOKUP(F19,[1]总表!$A$3:$AF$30000,32,FALSE)","v":"语文"},"56.50"]
[18,"杨胜芝",20230603010118,"01","18",2146,{"$f":"VLOOKUP(F20,[1]总表!$A$3:$AF$30000,31,FALSE)","v":"初中"},{"$f":"VLOOKUP(F20,[1]总表!$A$3:$AF$30000,32,FALSE)","v":"语文"},"62"]
[19,"杨思意",20230603010119,"01","19",2488,{"$f":"VLOOKUP(F21,[1]总表!$A$3:$AF$30000,31,FALSE)","v":"初中"},{"$f":"VLOOKUP(F21,[1]总表!$A$3:$AF$30000,32,FALSE)","v":"语文"},"65.50"]
[20,"陈雪林",20230603010120,"01","20",2271,{"$f":"VLOOKUP(F22,[1]总表!$A$3:$AF$30000,31,FALSE)","v":"初中"},{"$f":"VLOOKUP(F22,[1]总表!$A$3:$AF$30000,32,FALSE)","v":"语文"},"68"]
[21,"杨琪",20230603010121,"01","21",1976,{"$f":"VLOOKUP(F23,[1]总表!$A$3:$AF$30000,31,FALSE)","v":"初中"},{"$f":"VLOOKUP(F23,[1]总表!$A$3:$AF$30000,32,FALSE)","v":"语文"},"缺考"]
[22,"龙琳",20230603010122,"01","22",2657,{"$f":"VLOOKUP(F24,[1]总表!$A$3:$AF$30000,31,FALSE)","v":"初中"},{"$f":"VLOOKUP(F24,[1]总表!$A$3:$AF$30000,32,FALSE)","v":"语文"},"缺考"]
[23,"欧克霞",20230603010123,"01","23",2605,{"$f":"VLOOKUP(F25,[1]总表!$A$3:$AF$30000,31,FALSE)","v":"初中"},{"$f":"VLOOKUP(F25,[1]总表!$A$3:$AF$30000,32,FALSE)","v":"语文"},"61.50"]
[24,"杨娟",20230603010124,"01","24",2007,{"$f":"VLOOKUP(F26,[1]总表!$A$3:$AF$30000,31,FALSE)","v":"初中"},{"$f":"VLOOKUP(F26,[1]总表!$A$3:$AF$30000,32,FALSE)","v":"语文"},"72.50"]
[25,"雷华燕",20230603010125,"01","25",1929,{"$f":"VLOOKUP(F27,[1]总表!$A$3:$AF$30000,31,FALSE)","v":"初中"},{"$f":"VLOOKUP(F27,[1]总表!$A$3:$AF$30000,32,FALSE)","v":"语文"},"75"]
[26,"杨曼",20230603010126,"01","26",2209,{"$f":"VLOOKUP(F28,[1]总表!$A$3:$AF$30000,31,FALSE)","v":"初中"},{"$f":"VLOOKUP(F28,[1]总表!$A$3:$AF$30000,32,FALSE)","v":"语文"},"69"]
[27,"任美錞",20230603010127,"01","27",2049,{"$f":"VLOOKUP(F29,[1]总表!$A$3:$AF$30000,31,FALSE)","v":"初中"},{"$f":"VLOOKUP(F29,[1]总表!$A$3:$AF$30000,32,FALSE)","v":"语文"},"42.50"]
[28,"田丽霞",20230603010128,"01","28",1834,{"$f":"VLOOKUP(F30,[1]总表!$A$3:$AF$30000,31,FALSE)","v":"初中"},{"$f":"VLOOKUP(F30,[1]总表!$A$3:$AF$30000,32,FALSE)","v":"语文"},"61"]
[29,"敖美芬",20230603010129,"01","29",2457,{"$f":"VLOOKUP(F31,[1]总表!$A$3:$AF$30000,31,FALSE)","v":"初中"},{"$f":"VLOOKUP(F31,[1]总表!$A$3:$AF$30000,32,FALSE)","v":"语文"},"67"]
[30,"陈晴怡",20230603010130,"01","30",2585,{"$f":"VLOOKUP(F32,[1]总表!$A$3:$AF$30000,31,FALSE)","v":"初中"},{"$f":"VLOOKUP(F32,[1]总表!$A$3:$AF$30000,32,FALSE)","v":"语文"},"67.50"]
[31,"龙梅",20230603010201,"02","01",2350,{"$f":"VLOOKUP(F33,[1]总表!$A$3:$AF$30000,31,FALSE)","v":"初中"},{"$f":"VLOOKUP(F33,[1]总表!$A$3:$AF$30000,32,FALSE)","v":"语文"},"65"]
[32,"杨娜",20230603010202,"02","02",2144,{"$f":"VLOOKUP(F34,[1]总表!$A$3:$AF$30000,31,FALSE)","v":"初中"},{"$f":"VLOOKUP(F34,[1]总表!$A$3:$AF$30000,32,FALSE)","v":"语文"},"52"]
[33,"罗利华",20230603010203,"02","03",2527,{"$f":"VLOOKUP(F35,[1]总表!$A$3:$AF$30000,31,FALSE)","v":"初中"},{"$f":"VLOOKUP(F35,[1]总表!$A$3:$AF$30000,32,FALSE)","v":"语文"},"50"]
[34,"冉浩然",20230603010204,"02","04",2482,{"$f":"VLOOKUP(F36,[1]总表!$A$3:$AF$30000,31,FALSE)","v":"初中"},{"$f":"VLOOKUP(F36,[1]总表!$A$3:$AF$30000,32,FALSE)","v":"语文"},"63.50"]
[35,"石雪倩",20230603010205,"02","05",2056,{"$f":"VLOOKUP(F37,[1]总表!$A$3:$AF$30000,31,FALSE)","v":"初中"},{"$f":"VLOOKUP(F37,[1]总表!$A$3:$AF$30000,32,FALSE)","v":"语文"},"70.50"]
[36,"吴亚萍",20230603010206,"02","06",2127,{"$f":"VLOOKUP(F38,[1]总表!$A$3:$AF$30000,31,FALSE)","v":"初中"},{"$f":"VLOOKUP(F38,[1]总表!$A$3:$AF$30000,32,FALSE)","v":"语文"},"66"]
[37,"罗阳",20230603010207,"02","07",2538,{"$f":"VLOOKUP(F39,[1]总表!$A$3:$AF$30000,31,FALSE)","v":"初中"},{"$f":"VLOOKUP(F39,[1]总表!$A$3:$AF$30000,32,FALSE)","v":"语文"},"46.50"]
[38,"吴志娟",20230603010208,"02","08",1819,{"$f":"VLOOKUP(F40,[1]总表!$A$3:$AF$30000,31,FALSE)","v":"初中"},{"$f":"VLOOKUP(F40,[1]总表!$A$3:$AF$30000,32,FALSE)","v":"语文"},"60.50"]
[39,"伍娇",20230603010209,"02","09",2434,{"$f":"VLOOKUP(F41,[1]总表!$A$3:$AF$30000,31,FALSE)","v":"初中"},{"$f":"VLOOKUP(F41,[1]总表!$A$3:$AF$30000,32,FALSE)","v":"语文"},"58.50"]
[40,"石秋燕",20230603010210,"02","10",1970,{"$f":"VLOOKUP(F42,[1]总表!$A$3:$AF$30000,31,FALSE)","v":"初中"},{"$f":"VLOOKUP(F42,[1]总表!$A$3:$AF$30000,32,FALSE)","v":"语文"},"58.50"]
[41,"龙先飞",20230603010211,"02","11",1876,{"$f":"VLOOKUP(F43,[1]总表!$A$3:$AF$30000,31,FALSE)","v":"初中"},{"$f":"VLOOKUP(F43,[1]总表!$A$3:$AF$30000,32,FALSE)","v":"语文"},"54.50"]
[42,"杨娜娜",20230603010212,"02","12",2533,{"$f":"VLOOKUP(F44,[1]总表!$A$3:$AF$30000,31,FALSE)","v":"初中"},{"$f":"VLOOKUP(F44,[1]总表!$A$3:$AF$30000,32,FALSE)","v":"语文"},"53"]
[43,"符颖",20230603010213,"02","13",2115,{"$f":"VLOOKUP(F45,[1]总表!$A$3:$AF$30000,31,FALSE)","v":"初中"},{"$f":"VLOOKUP(F45,[1]总表!$A$3:$AF$30000,32,FALSE)","v":"语文"},"58"]
[44,"龙林",20230603010214,"02","14",2511,{"$f":"VLOOKUP(F46,[1]总表!$A$3:$AF$30000,31,FALSE)","v":"初中"},{"$f":"VLOOKUP(F46,[1]总表!$A$3:$AF$30000,32,FALSE)","v":"语文"},"58.50"]
[45,"罗雯昕",20230603010215,"02","15",2307,{"$f":"VLOOKUP(F47,[1]总表!$A$3:$AF$30000,31,FALSE)","v":"初中"},{"$f":"VLOOKUP(F47,[1]总表!$A$3:$AF$30000,32,FALSE)","v":"语文"},"49"]
[46,"姚慧敏",20230603010216,"02","16",1914,{"$f":"VLOOKUP(F48,[1]总表!$A$3:$AF$30000,31,FALSE)","v":"初中"},{"$f":"VLOOKUP(F48,[1]总表!$A$3:$AF$30000,32,FALSE)","v":"语文"},"59.50"]
[47,"黄庆",20230603010217,"02","17",2528,{"$f":"VLOOKUP(F49,[1]总表!$A$3:$AF$30000,31,FALSE)","v":"初中"},{"$f":"VLOOKUP(F49,[1]总表!$A$3:$AF$30000,32,FALSE)","v":"语文"},"61"]
[48,"田利娟",20230603010218,"02","18",2352,{"$f":"VLOOKUP(F50,[1]总表!$A$3:$AF$30000,31,FALSE)","v":"初中"},{"$f":"VLOOKUP(F50,[1]总表!$A$3:$AF$30000,32,FALSE)","v":"语文"},"54"]
[49,"詹雨玲",20230603010219,"02","19",2476,{"$f":"VLOOKUP(F51,[1]总表!$A$3:$AF$30000,31,FALSE)","v":"初中"},{"$f":"VLOOKUP(F51,[1]总表!$A$3:$AF$30000,32,FALSE)","v":"语文"},"60"]
[50,"郭世素",20230603010220,"02","20",2084,{"$f":"VLOOKUP(F52,[1]总表!$A$3:$AF$30000,31,FALSE)","v":"初中"},{"$f":"VLOOKUP(F52,[1]总表!$A$3:$AF$30000,32,FALSE)","v":"语文"},"63"]
[51,"田龙",20230603010221,"02","21",1869,{"$f":"VLOOKUP(F53,[1]总表!$A$3:$AF$30000,31,FALSE)","v":"初中"},{"$f":"VLOOKUP(F53,[1]总表!$A$3:$AF$30000,32,FALSE)","v":"语文"},"66"]
[52,"雷芬",20230603010222,"02","22",2501,{"$f":"VLOOKUP(F54,[1]总表!$A$3:$AF$30000,31,FALSE)","v":"初中"},{"$f":"VLOOKUP(F54,[1]总表!$A$3:$AF$30000,32,FALSE)","v":"语文"},"60"]
[53,"汪美婷",20230603010223,"02","23",2432,{"$f":"VLOOKUP(F55,[1]总表!$A$3:$AF$30000,31,FALSE)","v":"初中"},{"$f":"VLOOKUP(F55,[1]总表!$A$3:$AF$30000,32,FALSE)","v":"语文"},"59"]
[54,"罗珊",20230603010224,"02","24",2495,{"$f":"VLOOKUP(F56,[1]总表!$A$3:$AF$30000,31,FALSE)","v":"初中"},{"$f":"VLOOKUP(F56,[1]总表!$A$3:$AF$30000,32,FALSE)","v":"语文"},"71.50"]
[55,"龙雯惠",20230603010225,"02","25",2314,{"$f":"VLOOKUP(F57,[1]总表!$A$3:$AF$30000,31,FALSE)","v":"初中"},{"$f":"VLOOKUP(F57,[1]总表!$A$3:$AF$30000,32,FALSE)","v":"语文"},"53.50"]
[56,"鞠玲慧",20230603010226,"02","26",2481,{"$f":"VLOOKUP(F58,[1]总表!$A$3:$AF$30000,31,FALSE)","v":"初中"},{"$f":"VLOOKUP(F58,[1]总表!$A$3:$AF$30000,32,FALSE)","v":"语文"},"63"]
[57,"安田旭",20230603010227,"02","27",2113,{"$f":"VLOOKUP(F59,[1]总表!$A$3:$AF$30000,31,FALSE)","v":"初中"},{"$f":"VLOOKUP(F59,[1]总表!$A$3:$AF$30000,32,FALSE)","v":"语文"},"53"]
[58,"杜万琴",20230603010228,"02","28",2070,{"$f":"VLOOKUP(F60,[1]总表!$A$3:$AF$30000,31,FALSE)","v":"初中"},{"$f":"VLOOKUP(F60,[1]总表!$A$3:$AF$30000,32,FALSE)","v":"语文"},"58"]
[59,"吴映雪",20230603010229,"02","29",2294,{"$f":"VLOOKUP(F61,[1]总表!$A$3:$AF$30000,31,FALSE)","v":"初中"},{"$f":"VLOOKUP(F61,[1]总表!$A$3:$AF$30000,32,FALSE)","v":"语文"},"57.50"]
[60,"腾文坤",20230603010230,"02","30",2324,{"$f":"VLOOKUP(F62,[1]总表!$A$3:$AF$30000,31,FALSE)","v":"初中"},{"$f":"VLOOKUP(F62,[1]总表!$A$3:$AF$30000,32,FALSE)","v":"语文"},"48.50"]
[61,"雷美",20230603010301,"03","01",2175,{"$f":"VLOOKUP(F63,[1]总表!$A$3:$AF$30000,31,FALSE)","v":"初中"},{"$f":"VLOOKUP(F63,[1]总表!$A$3:$AF$30000,32,FALSE)","v":"语文"},"58.50"]
[62,"尹吉美",20230603010302,"03","02",2349,{"$f":"VLOOKUP(F64,[1]总表!$A$3:$AF$30000,31,FALSE)","v":"初中"},{"$f":"VLOOKUP(F64,[1]总表!$A$3:$AF$30000,32,FALSE)","v":"语文"},"缺考"]
[63,"唐艳妮",20230603010303,"03","03",2147,{"$f":"VLOOKUP(F65,[1]总表!$A$3:$AF$30000,31,FALSE)","v":"初中"},{"$f":"VLOOKUP(F65,[1]总表!$A$3:$AF$30000,32,FALSE)","v":"语文"},"65.50"]
[64,"滕凝露",20230603010304,"03","04",2110,{"$f":"VLOOKUP(F66,[1]总表!$A$3:$AF$30000,31,FALSE)","v":"初中"},{"$f":"VLOOKUP(F66,[1]总表!$A$3:$AF$30000,32,FALSE)","v":"语文"},"56"]
[65,"肖丽君",20230603010305,"03","05",2595,{"$f":"VLOOKUP(F67,[1]总表!$A$3:$AF$30000,31,FALSE)","v":"初中"},{"$f":"VLOOKUP(F67,[1]总表!$A$3:$AF$30000,32,FALSE)","v":"语文"},"74"]
[66,"张晓琴",20230603010306,"03","06",2548,{"$f":"VLOOKUP(F68,[1]总表!$A$3:$AF$30000,31,FALSE)","v":"初中"},{"$f":"VLOOKUP(F68,[1]总表!$A$3:$AF$30000,32,FALSE)","v":"语文"},"54.50"]
[67,"杨琴",20230603010307,"03","07",2399,{"$f":"VLOOKUP(F69,[1]总表!$A$3:$AF$30000,31,FALSE)","v":"初中"},{"$f":"VLOOKUP(F69,[1]总表!$A$3:$AF$30000,32,FALSE)","v":"语文"},"50.50"]
[68,"刘佳敏",20230603010308,"03","08",2222,{"$f":"VLOOKUP(F70,[1]总表!$A$3:$AF$30000,31,FALSE)","v":"初中"},{"$f":"VLOOKUP(F70,[1]总表!$A$3:$AF$30000,32,FALSE)","v":"语文"},"71"]
[69,"石勇登",20230603010309,"03","09",1920,{"$f":"VLOOKUP(F71,[1]总表!$A$3:$AF$30000,31,FALSE)","v":"初中"},{"$f":"VLOOKUP(F71,[1]总表!$A$3:$AF$30000,32,FALSE)","v":"语文"},"66"]
[70,"王雅婷",20230603010310,"03","10",1827,{"$f":"VLOOKUP(F72,[1]总表!$A$3:$AF$30000,31,FALSE)","v":"初中"},{"$f":"VLOOKUP(F72,[1]总表!$A$3:$AF$30000,32,FALSE)","v":"语文"},"61.50"]
[71,"刘庆君",20230603010311,"03","11",2431,{"$f":"VLOOKUP(F73,[1]总表!$A$3:$AF$30000,31,FALSE)","v":"初中"},{"$f":"VLOOKUP(F73,[1]总表!$A$3:$AF$30000,32,FALSE)","v":"语文"},"61.50"]
[72,"吴红霞",20230603010312,"03","12",2272,{"$f":"VLOOKUP(F74,[1]总表!$A$3:$AF$30000,31,FALSE)","v":"初中"},{"$f":"VLOOKUP(F74,[1]总表!$A$3:$AF$30000,32,FALSE)","v":"语文"},"64.50"]
[73,"田江碧",20230603010313,"03","13",2342,{"$f":"VLOOKUP(F75,[1]总表!$A$3:$AF$30000,31,FALSE)","v":"初中"},{"$f":"VLOOKUP(F75,[1]总表!$A$3:$AF$30000,32,FALSE)","v":"语文"},"65.50"]
[74,"卿玉玲",20230603010314,"03","14",2628,{"$f":"VLOOKUP(F76,[1]总表!$A$3:$AF$30000,31,FALSE)","v":"初中"},{"$f":"VLOOKUP(F76,[1]总表!$A$3:$AF$30000,32,FALSE)","v":"语文"},"59.50"]
[75,"龙微微",20230603010315,"03","15",2263,{"$f":"VLOOKUP(F77,[1]总表!$A$3:$AF$30000,31,FALSE)","v":"初中"},{"$f":"VLOOKUP(F77,[1]总表!$A$3:$AF$30000,32,FALSE)","v":"语文"},"67"]
[76,"杨秀辉",20230603010316,"03","16",1991,{"$f":"VLOOKUP(F78,[1]总表!$A$3:$AF$30000,31,FALSE)","v":"初中"},{"$f":"VLOOKUP(F78,[1]总表!$A$3:$AF$30000,32,FALSE)","v":"语文"},"69"]
[77,"李梅红",20230603010317,"03","17",1898,{"$f":"VLOOKUP(F79,[1]总表!$A$3:$AF$30000,31,FALSE)","v":"初中"},{"$f":"VLOOKUP(F79,[1]总表!$A$3:$AF$30000,32,FALSE)","v":"语文"},"59"]
[78,"周颖",20230603010318,"03","18",2611,{"$f":"VLOOKUP(F80,[1]总表!$A$3:$AF$30000,31,FALSE)","v":"初中"},{"$f":"VLOOKUP(F80,[1]总表!$A$3:$AF$30000,32,FALSE)","v":"语文"},"缺考"]
[79,"杨文惠",20230603010319,"03","19",2081,{"$f":"VLOOKUP(F81,[1]总表!$A$3:$AF$30000,31,FALSE)","v":"初中"},{"$f":"VLOOKUP(F81,[1]总表!$A$3:$AF$30000,32,FALSE)","v":"语文"},"47"]
[80,"唐倩",20230603010320,"03","20",2279,{"$f":"VLOOKUP(F82,[1]总表!$A$3:$AF$30000,31,FALSE)","v":"初中"},{"$f":"VLOOKUP(F82,[1]总表!$A$3:$AF$30000,32,FALSE)","v":"语文"},"54.50"]
[81,"龙梦彬",20230603010321,"03","21",2559,{"$f":"VLOOKUP(F83,[1]总表!$A$3:$AF$30000,31,FALSE)","v":"初中"},{"$f":"VLOOKUP(F83,[1]总表!$A$3:$AF$30000,32,FALSE)","v":"语文"},"58.50"]
[82,"周梦姣",20230603010322,"03","22",2118,{"$f":"VLOOKUP(F84,[1]总表!$A$3:$AF$30000,31,FALSE)","v":"初中"},{"$f":"VLOOKUP(F84,[1]总表!$A$3:$AF$30000,32,FALSE)","v":"语文"},"65"]
[83,"田迪丹",20230603010323,"03","23",2207,{"$f":"VLOOKUP(F85,[1]总表!$A$3:$AF$30000,31,FALSE)","v":"初中"},{"$f":"VLOOKUP(F85,[1]总表!$A$3:$AF$30000,32,FALSE)","v":"语文"},"56.50"]
[84,"石峰",20230603010324,"03","24",2107,{"$f":"VLOOKUP(F86,[1]总表!$A$3:$AF$30000,31,FALSE)","v":"初中"},{"$f":"VLOOKUP(F86,[1]总表!$A$3:$AF$30000,32,FALSE)","v":"语文"},"63"]
[85,"杨渺",20230603010325,"03","25",2385,{"$f":"VLOOKUP(F87,[1]总表!$A$3:$AF$30000,31,FALSE)","v":"初中"},{"$f":"VLOOKUP(F87,[1]总表!$A$3:$AF$30000,32,FALSE)","v":"语文"},"67"]
[86,"麻明芳",20230603010326,"03","26",2417,{"$f":"VLOOKUP(F88,[1]总表!$A$3:$AF$30000,31,FALSE)","v":"初中"},{"$f":"VLOOKUP(F88,[1]总表!$A$3:$AF$30000,32,FALSE)","v":"语文"},"53.50"]
[87,"杨忍",20230603010327,"03","27",2082,{"$f":"VLOOKUP(F89,[1]总表!$A$3:$AF$30000,31,FALSE)","v":"初中"},{"$f":"VLOOKUP(F89,[1]总表!$A$3:$AF$30000,32,FALSE)","v":"语文"},"63"]
[88,"吴倩",20230603010328,"03","28",2523,{"$f":"VLOOKUP(F90,[1]总表!$A$3:$AF$30000,31,FALSE)","v":"初中"},{"$f":"VLOOKUP(F90,[1]总表!$A$3:$AF$30000,32,FALSE)","v":"语文"},"60"]
[89,"汪佳",20230603010329,"03","29",1877,{"$f":"VLOOKUP(F91,[1]总表!$A$3:$AF$30000,31,FALSE)","v":"初中"},{"$f":"VLOOKUP(F91,[1]总表!$A$3:$AF$30000,32,FALSE)","v":"语文"},"65.50"]
[90,"付亚玲",20230603010330,"03","30",2186,{"$f":"VLOOKUP(F92,[1]总表!$A$3:$AF$30000,31,FALSE)","v":"初中"},{"$f":"VLOOKUP(F92,[1]总表!$A$3:$AF$30000,32,FALSE)","v":"语文"},"63"]
[91,"胡欣宇",20230603010401,"04","01",2261,{"$f":"VLOOKUP(F93,[1]总表!$A$3:$AF$30000,31,FALSE)","v":"初中"},{"$f":"VLOOKUP(F93,[1]总表!$A$3:$AF$30000,32,FALSE)","v":"语文"},"59"]
[92,"李沙沙",20230603010402,"04","02",2587,{"$f":"VLOOKUP(F94,[1]总表!$A$3:$AF$30000,31,FALSE)","v":"初中"},{"$f":"VLOOKUP(F94,[1]总表!$A$3:$AF$30000,32,FALSE)","v":"语文"},"53.50"]
[93,"龙红艳",20230603010403,"04","03",2410,{"$f":"VLOOKUP(F95,[1]总表!$A$3:$AF$30000,31,FALSE)","v":"初中"},{"$f":"VLOOKUP(F95,[1]总表!$A$3:$AF$30000,32,FALSE)","v":"语文"},"63.50"]
[94,"吴露",20230603010404,"04","04",1829,{"$f":"VLOOKUP(F96,[1]总表!$A$3:$AF$30000,31,FALSE)","v":"初中"},{"$f":"VLOOKUP(F96,[1]总表!$A$3:$AF$30000,32,FALSE)","v":"语文"},"51"]
[95,"龙正芬",20230603010405,"04","05",2008,{"$f":"VLOOKUP(F97,[1]总表!$A$3:$AF$30000,31,FALSE)","v":"初中"},{"$f":"VLOOKUP(F97,[1]总表!$A$3:$AF$30000,32,FALSE)","v":"语文"},"66"]
[96,"代方慧",20230603010406,"04","06",2129,{"$f":"VLOOKUP(F98,[1]总表!$A$3:$AF$30000,31,FALSE)","v":"初中"},{"$f":"VLOOKUP(F98,[1]总表!$A$3:$AF$30000,32,FALSE)","v":"语文"},"66"]
[97,"殷小妹",20230603010407,"04","07",2442,{"$f":"VLOOKUP(F99,[1]总表!$A$3:$AF$30000,31,FALSE)","v":"初中"},{"$f":"VLOOKUP(F99,[1]总表!$A$3:$AF$30000,32,FALSE)","v":"语文"},"62.50"]
[98,"田昱鑫",20230603010408,"04","08",1882,{"$f":"VLOOKUP(F100,[1]总表!$A$3:$AF$30000,31,FALSE)","v":"初中"},{"$f":"VLOOKUP(F100,[1]总表!$A$3:$AF$30000,32,FALSE)","v":"语文"},"56.50"]
[99,"田希",20230603010409,"04","09",1996,{"$f":"VLOOKUP(F101,[1]总表!$A$3:$AF$30000,31,FALSE)","v":"初中"},{"$f":"VLOOKUP(F101,[1]总表!$A$3:$AF$30000,32,FALSE)","v":"语文"},"58"]
[100,"杨茂春",20230603010410,"04","10",2474,{"$f":"VLOOKUP(F102,[1]总表!$A$3:$AF$30000,31,FALSE)","v":"初中"},{"$f":"VLOOKUP(F102,[1]总表!$A$3:$AF$30000,32,FALSE)","v":"语文"},"52.50"]
[101,"肖雅丹",20230603010411,"04","11",2160,{"$f":"VLOOKUP(F103,[1]总表!$A$3:$AF$30000,31,FALSE)","v":"初中"},{"$f":"VLOOKUP(F103,[1]总表!$A$3:$AF$30000,32,FALSE)","v":"语文"},"56"]
[102,"吴林琴",20230603010412,"04","12",2471,{"$f":"VLOOKUP(F104,[1]总表!$A$3:$AF$30000,31,FALSE)","v":"初中"},{"$f":"VLOOKUP(F104,[1]总表!$A$3:$AF$30000,32,FALSE)","v":"语文"},"61"]
[103,"黄婷",20230603010413,"04","13",2299,{"$f":"VLOOKUP(F105,[1]总表!$A$3:$AF$30000,31,FALSE)","v":"初中"},{"$f":"VLOOKUP(F105,[1]总表!$A$3:$AF$30000,32,FALSE)","v":"语文"},"55.50"]
[104,"付金玲",20230603010414,"04","14",1963,{"$f":"VLOOKUP(F106,[1]总表!$A$3:$AF$30000,31,FALSE)","v":"初中"},{"$f":"VLOOKUP(F106,[1]总表!$A$3:$AF$30000,32,FALSE)","v":"语文"},"60"]
[105,"李青青",20230603010415,"04","15",1974,{"$f":"VLOOKUP(F107,[1]总表!$A$3:$AF$30000,31,FALSE)","v":"初中"},{"$f":"VLOOKUP(F107,[1]总表!$A$3:$AF$30000,32,FALSE)","v":"语文"},"缺考"]
[106,"黎思涵",20230603010416,"04","16",2322,{"$f":"VLOOKUP(F108,[1]总表!$A$3:$AF$30000,31,FALSE)","v":"初中"},{"$f":"VLOOKUP(F108,[1]总表!$A$3:$AF$30000,32,FALSE)","v":"语文"},"64.50"]
[107,"杨静",20230603010417,"04","17",2156,{"$f":"VLOOKUP(F109,[1]总表!$A$3:$AF$30000,31,FALSE)","v":"初中"},{"$f":"VLOOKUP(F109,[1]总表!$A$3:$AF$30000,32,FALSE)","v":"语文"},"69"]
[108,"杨静霞",20230603010418,"04","18",2193,{"$f":"VLOOKUP(F110,[1]总表!$A$3:$AF$30000,31,FALSE)","v":"初中"},{"$f":"VLOOKUP(F110,[1]总表!$A$3:$AF$30000,32,FALSE)","v":"语文"},"62"]
[109,"唐蝶",20230603010419,"04","19",2025,{"$f":"VLOOKUP(F111,[1]总表!$A$3:$AF$30000,31,FALSE)","v":"初中"},{"$f":"VLOOKUP(F111,[1]总表!$A$3:$AF$30000,32,FALSE)","v":"语文"},"57.50"]
[110,"吴艳林",20230603010420,"04","20",2038,{"$f":"VLOOKUP(F112,[1]总表!$A$3:$AF$30000,31,FALSE)","v":"初中"},{"$f":"VLOOKUP(F112,[1]总表!$A$3:$AF$30000,32,FALSE)","v":"语文"},"58"]
[111,"王小慧",20230603010421,"04","21",2475,{"$f":"VLOOKUP(F113,[1]总表!$A$3:$AF$30000,31,FALSE)","v":"初中"},{"$f":"VLOOKUP(F113,[1]总表!$A$3:$AF$30000,32,FALSE)","v":"语文"},"55"]
[112,"田砚兮",20230603010422,"04","22",1899,{"$f":"VLOOKUP(F114,[1]总表!$A$3:$AF$30000,31,FALSE)","v":"初中"},{"$f":"VLOOKUP(F114,[1]总表!$A$3:$AF$30000,32,FALSE)","v":"语文"},"缺考"]
[113,"安杰",20230603010423,"04","23",2435,{"$f":"VLOOKUP(F115,[1]总表!$A$3:$AF$30000,31,FALSE)","v":"初中"},{"$f":"VLOOKUP(F115,[1]总表!$A$3:$AF$30000,32,FALSE)","v":"语文"},"48"]
[114,"李贵琴",20230603010424,"04","24",2192,{"$f":"VLOOKUP(F116,[1]总表!$A$3:$AF$30000,31,FALSE)","v":"初中"},{"$f":"VLOOKUP(F116,[1]总表!$A$3:$AF$30000,32,FALSE)","v":"语文"},"58.50"]
[115,"彭零丽",20230603010425,"04","25",2630,{"$f":"VLOOKUP(F117,[1]总表!$A$3:$AF$30000,31,FALSE)","v":"初中"},{"$f":"VLOOKUP(F117,[1]总表!$A$3:$AF$30000,32,FALSE)","v":"语文"},"61"]
[116,"段艳群",20230603010426,"04","26",1828,{"$f":"VLOOKUP(F118,[1]总表!$A$3:$AF$30000,31,FALSE)","v":"初中"},{"$f":"VLOOKUP(F118,[1]总表!$A$3:$AF$30000,32,FALSE)","v":"语文"},"58.50"]
[117,"梁微",20230603010427,"04","27",2643,{"$f":"VLOOKUP(F119,[1]总表!$A$3:$AF$30000,31,FALSE)","v":"初中"},{"$f":"VLOOKUP(F119,[1]总表!$A$3:$AF$30000,32,FALSE)","v":"语文"},"53"]
[118,"杨靓琳",20230603010428,"04","28",2040,{"$f":"VLOOKUP(F120,[1]总表!$A$3:$AF$30000,31,FALSE)","v":"初中"},{"$f":"VLOOKUP(F120,[1]总表!$A$3:$AF$30000,32,FALSE)","v":"语文"},"57"]
{"$rows_left_out":1814}
{"sheet":"Sheet3","index":1,"n_rows":0,"n_cols":0,"rows_kept":0}