{"text_format":"3","workbook":"xlsx","n_sheets":2,"sheets":["Sheet1","Sheet2"],"not_rendered":{"external_links":1,"defined_names":2},"read":"whole","date_system":"1900"}

{"sheet":"Sheet1","index":0,"n_rows":25,"n_cols":5,"rows_kept":25,"merged":[[0,0,0,3]]}
["安顺市公安局面向社会公开招聘留置看护警务辅助人员拟招聘人员名单(第一批)"]
["序号","姓名","报考职位","备注"]
[1,"吴煜炜","01",null,{"$f":"VLOOKUP(B:B,[1]Sheet1!$C:$C,1,0)","v":"吴煜炜"}]
[2,"杨阳","01",null,{"$f":"VLOOKUP(B:B,[1]Sheet1!$C:$C,1,0)","v":"杨阳"}]
[3,"滕明名","01",null,{"$f":"VLOOKUP(B:B,[1]Sheet1!$C:$C,1,0)","v":"滕明名"}]
[4,"钮青云","01",null,{"$f":"VLOOKUP(B:B,[1]Sheet1!$C:$C,1,0)","v":"钮青云"}]
[5,"方浩伦","01",null,{"$f":"VLOOKUP(B:B,[1]Sheet1!$C:$C,1,0)","v":"方浩伦"}]
[6,"尚驭今","01",null,{"$f":"VLOOKUP(B:B,[1]Sheet1!$C:$C,1,0)","v":"尚驭今"}]
[7,"陈明华","01",null,{"$f":"VLOOKUP(B:B,[1]Sheet1!$C:$C,1,0)","v":"陈明华"}]
[8,"王鹏","01",null,{"$f":"VLOOKUP(B:B,[1]Sheet1!$C:$C,1,0)","v":"王鹏"}]
[9,"陈家林","01",null,{"$f":"VLOOKUP(B:B,[1]Sheet1!$C:$C,1,0)","v":"陈家林"}]
[10,"伍瑞强","01",null,{"$f":"VLOOKUP(B:B,[1]Sheet1!$C:$C,1,0)","v":"伍瑞强"}]
[11,"周正波","01",null,{"$f":"VLOOKUP(B:B,[1]Sheet1!$C:$C,1,0)","v":"周正波"}]
[12,"王孟安","01",null,{"$f":"VLOOKUP(B:B,[1]Sheet1!$C:$C,1,0)","v":"王孟安"}]
[13,"王驰驰","02",null,{"$f":"VLOOKUP(B:B,[1]Sheet1!$C:$C,1,0)","v":"王驰驰"}]
[14,"张昊卿","02",null,{"$f":"VLOOKUP(B:B,[1]Sheet1!$C:$C,1,0)","v":"张昊卿"}]
[15,"庄前前","02",null,{"$f":"VLOOKUP(B:B,[1]Sheet1!$C:$C,1,0)","v":"庄前前"}]
[16,"朱林","02",null,{"$f":"VLOOKUP(B:B,[1]Sheet1!$C:$C,1,0)","v":"朱林"}]
[17,"陈毫毫","02",null,{"$f":"VLOOKUP(B:B,[1]Sheet1!$C:$C,1,0)","v":"陈毫毫"}]
[18,"赵盛民","02",null,{"$f":"VLOOKUP(B:B,[1]Sheet1!$C:$C,1,0)","v":"赵盛民"}]
[19,"陈家根","02",null,{"$f":"VLOOKUP(B:B,[1]Sheet1!$C:$C,1,0)","v":"陈家根"}]
[20,"王金海","02",null,{"$f":"VLOOKUP(B:B,[1]Sheet1!$C:$C,1,0)","v":"王金海"}]
[21,"陈世毅","02",null,{"$f":"VLOOKUP(B:B,[1]Sheet1!$C:$C,1,0)","v":"陈世毅"}]
[22,"李庆华","02",null,{"$f":"VLOOKUP(B:B,[1]Sheet1!$C:$C,1,0)","v":"李庆华"}]
[23,"张亮","02",null,{"$f":"VLOOKUP(B:B,[1]Sheet1!$C:$C,1,0)","v":"张亮"}]

{"sheet":"Sheet2","index":1,"n_rows":16,"n_cols":7,"rows_kept":16,"merged":[[0,0,0,4]]}
["安顺市公安局2023年面向社会公开招聘留置\n看护警务辅助人员拟招聘人员名单"]
["序号","姓名","性别","准考证号","报考岗位"]
[1,"李想","男",2023098,1]
[2,"张维斌","男",2023056,1]
[3,"陈曦","男",2023087,1]
[4,"徐发奇","男",2023118,1]
[5,"龙寅","男",2023099,1]
[6,"曾嵚睿","男",2023119,1]
[7,"李小路","男",2023097,1]
[8,"李维","男",2023096,1]
[9,"俞飞红","男",2023102,1]
[10,"杨蕾可","女",2023027,2]
[11,"胡思毅","女",2023007,2]
[]
[]
[{"$nulls":6},"   "]