{"text_format":"3","workbook":"xlsx","n_sheets":3,"sheets":["体检名单","Sheet2","Sheet3"],"not_rendered":{"external_links":1,"defined_names":2},"read":"whole","date_system":"1900"}

{"sheet":"体检名单","index":0,"n_rows":61,"n_cols":7,"rows_kept":61,"merged":[[0,0,0,6]]}
["六枝特区参加2022年第十届中国贵州人才博会引进高层次、急需紧缺人才\n体检人员名单"]
["序号","引进单位","姓名","性别","最高\n学历","专业","备注"]
[1,"六枝特区第七中学","伍小毛","男","本科","汉语言文学"]
[2,"六枝特区第七中学","唐志豪","女","本科","汉语言文学"]
[3,"六枝特区第七中学","丁武科","男","硕士研究生","汉语国际教育"]
[4,"六枝特区第一中学","邓晓丽","女","本科","汉语言文学"]
[5,"六枝特区实验中学","徐青青","女","硕士研究生","学科教学（思政）"]
[6,"六盘水市第二中学","邓思",{"$f":"VLOOKUP(C8,[1]Worksheet!$B$18:$K$120,3,0)","v":"男"},"硕士研究生","学科教学（思政）"]
[7,"六枝特区第七中学","王莎莎","女","本科","生物科学"]
[8,"六枝特区实验中学","陈海峰","男","本科","生态学"]
[9,"六盘水市第二中学","姚时舣",{"$f":"VLOOKUP(C11,[1]Worksheet!$B$18:$K$120,3,0)","v":"女"},"本科","生物技术"]
[10,"六枝特区实验中学","石春华","女","硕士研究生","学科教育（地理）"]
[11,"六枝特区第一中学","王兴薇","女","本科","地理科学（师范）"]
[12,"六枝特区第七中学","娄小婷","女","本科","心理学"]
[13,"六枝特区实验中学","冉虹","女","本科","应用心理学"]
[14,"六枝特区第七中学","余振英","女","本科","化学"]
[15,"六枝特区第七中学","陈诚","男","本科","化学"]
[16,"六枝特区第七中学","王旋","女","硕士研究生","学科教学（化学）"]
[17,"六枝特区第七中学","白玉兵","男","本科","化学"]
[18,"六枝特区实验中学","杨陆宇","男","硕士研究生","学科教学（化学）"]
[19,"六枝特区第七中学","陈丹","女","本科","物理学"]
[20,"六枝特区第七中学","陈帅学","男","本科","物理学"]
[21,"六枝特区第七中学","何志伦","男","本科","物理学"]
[22,"六盘水市第二中学","王富贵",{"$f":"VLOOKUP(C24,[1]Worksheet!$B$18:$K$120,3,0)","v":"男"},"本科","物理学"]
[23,"六盘水市第二中学","蔡能映",{"$f":"VLOOKUP(C25,[1]Worksheet!$B$18:$K$120,3,0)","v":"女"},"本科","物理学"]
[24,"六枝特区第一中学","管育迅","男","本科","应用物理学"]
[25,"六枝特区第七中学","张品","男","本科","数学与应用数学"]
[26,"六枝特区第七中学","张飘","男","本科","数学与应用数学"]
[27,"六枝特区第七中学","王维","女","本科","数学与应用数学"]
[28,"六枝特区实验中学","王礼意","女","本科","数学与应用数学"]
[29,"六盘水市第二中学","蔡昊",{"$f":"VLOOKUP(C31,[1]Worksheet!$B$18:$K$120,3,0)","v":"男"},"本科","数学与应用数学"]
[30,"六枝特区实验中学","刘伟","男","本科","数字媒体技术"]
[31,"六枝特区第七中学","罗香","女","硕士研究生","音乐(声乐)"]
[32,"六枝特区实验中学","王丽","女","硕士研究生","音乐表演"]
[33,"六枝特区实验中学","李洪星","男","本科","雕塑"]
[34,"六枝特区第七中学","邓文艺","女","硕士研究生","美术"]
[35,"六枝特区第七中学","李晔","男","本科","体育教育"]
[36,"六枝特区第七中学","张仁顺","男","本科","体育教育"]
[37,"六枝特区实验中学","袁朗","男","本科","体育教育"]
[38,"六枝特区第七中学","张倩","女","硕士研究生","俄语语言文学"]
[39,"六枝特区第七中学","饶以苹","女","硕士研究生","德语笔译"]
[40,"六枝特区实验中学","代坤龙","男","本科","英语"]
[41,"六枝特区第七中学","刘巍威","女","硕士研究生","日语"]
[42,"六枝特区第一中学","唐春露","女","本科","日语"]
[43,"大用镇农业综合服务中心","吴忧","女","本科","植物保护"]
[44,"六枝特区电子商务发展服务中心","饶春","女","本科","国际经济与贸易"]
[45,"六盘水郎岱农业产业园区管理委员会","柏瑰","女","本科","财务管理"]
[46,"六盘水郎岱农业产业园区管理委员会","袁能","男","本科","城乡规划"]
[47,"六枝特区融媒体中心","甘稳","男","本科","编辑出版学"]
[48,"六枝特区融媒体中心","李丛语","女","本科","播音与主持艺术"]
[49,"六枝经济开发区\n路喜循环经济产业园区服务中心","袁于单","女","本科","建筑环境与设备工程"]
[50,"六枝特区党校","孙鉴","男","硕士研究生","诉讼法学"]
[51,"六枝特区党校","陈小兵","男","硕士研究生","宪法学与行政法学"]
[52,"六枝特区党校","张皓","男","本科","应用心理学"]
[53,"六枝特区党校","曾敏","女","硕士研究生","中共党史"]
[54,"六枝特区人民医院","蔡宇","女","硕士研究生","内科学"]
[55,"六枝特区人民医院","杨建伟","男","硕士研究生","高原医学"]
[56,"六盘水市第二人民医院","喻明慧","女","本科\n规培生","临床医学\n儿科医师"]
[57,"六盘水市第二人民医院","邓召丽","女","本科\n规培生","临床医学\n妇产科医师"]
[58,"六盘水市第二人民医院","杨杰","男","硕士研究生","中药学"]
[59,"六盘水市第二人民医院","候腾锡","男","本科\n副高级","计算机科学与技术"]

{"sheet":"Sheet2","index":1,"n_rows":0,"n_cols":0,"rows_kept":0}

{"sheet":"Sheet3","index":2,"n_rows":0,"n_cols":0,"rows_kept":0}